robotpkg/wip/sot-pattern-generator-v3 bulk build results

sot-pattern-generator-v3-3.4.2 (category wip or summary)

Platform Status Date Time Log files
Start Total brokenbrokenbybuildbulkcbbhcbbhbycmakeconfigureextractsysdep
Debian-11-x86_64N/A2026/09/ 902:42:1300:00:10ViewView
cmake>=3.22
Debian-12-x86_64Broken2026/09/ 912:49:1000:00:49
make: *** [package] Error 2
ViewViewViewViewView
Debian-13-x86_64Broken2026/09/ 909:32:3400:00:43
make: *** [package] Error 2
ViewViewViewViewView
Fedora-42-x86_64Broken2026/09/ 818:03:3700:00:46
make: *** [package] Error 2
ViewViewViewViewView
Fedora-44-x86_64Broken2026/09/ 907:10:5300:00:07
Required robotpkg package dynamic-graph-v3>=4.3.0: BROKEN Required robotpkg package jrl-walkgen-v3>=4.0.0: BROKEN Required robotpkg package py314-sot-core-v3>=4.11.7<5.0.0: BROKEN
View
NetBSD-10.0-x86_64Broken2026/09/ 911:34:4500:01:12
/usr/pkg/bin/gmake: *** [package] Error 2
ViewViewViewViewView
Rocky-8-x86_64Sysdep2026/09/ 907:00:0900:00:08ViewView
eigen3>=3.3
jrl-walkgen-v3>=4.0.0
pinocchio>=3
py36-sot-core-v3>=4.11.7<5.0.0
View
Ubuntu-20.04-x86_64N/A2026/09/ 905:20:5600:00:10ViewView
cmake>=3.22
py38-sot-core-v3>=4.11.7<5.0.0
Ubuntu-22.04-x86_64Broken2026/09/ 912:57:1200:00:52
make: *** [package] Error 2
ViewViewViewViewView
Ubuntu-24.04-x86_64Broken2026/09/ 911:32:5500:00:48
make: *** [package] Error 2
ViewViewViewViewView
Ubuntu-26.04-x86_64N/A2026/09/ 903:49:1500:00:09ViewView
boost-libs>=1.34.1