| Platform | Status | Date | Time | Log files | |||||||||
|---|---|---|---|---|---|---|---|---|---|---|---|---|---|
| Start | Total | broken | build | bulk | cbbh | cbbhby | cmake | configure | extract | sysdep | |||
| Debian-11-x86_64 | N/A | 2026/09/ 9 | 02:39:04 | 00:00:03 | View | View | cmake>=3.22 | ||||||
| Debian-12-x86_64 | Broken | 2026/09/ 9 | 12:44:08 | 00:00:44 | make: *** [package] Error 2
| View | View | View | View | View | |||
| Debian-13-x86_64 | Broken | 2026/09/ 9 | 09:27:57 | 00:00:39 | make: *** [package] Error 2
| View | View | View | View | View | |||
| Fedora-42-x86_64 | Broken | 2026/09/ 8 | 17:43:44 | 00:00:40 | make: *** [package] Error 2
| View | View | View | View | View | |||
| Fedora-44-x86_64 | Broken | 2026/09/ 9 | 07:03:08 | 00:00:08 | make: *** [package] Error 2
| View | View | View | View | ||||
| NetBSD-10.0-x86_64 | Broken | 2026/09/ 9 | 10:46:30 | 00:01:04 | /usr/pkg/bin/gmake: *** [package] Error 2
| View | View | View | View | View | |||
| Rocky-8-x86_64 | Sysdep | 2026/09/ 9 | 06:55:54 | 00:00:03 | View | View | eigen3>=3.3 pinocchio>=3 | View | |||||
| Ubuntu-20.04-x86_64 | N/A | 2026/09/ 9 | 04:54:36 | 00:00:04 | View | View | cmake>=3.22 | ||||||
| Ubuntu-22.04-x86_64 | Broken | 2026/09/ 9 | 12:43:36 | 00:00:45 | make: *** [package] Error 2
| View | View | View | View | View | |||
| Ubuntu-24.04-x86_64 | Broken | 2026/09/ 9 | 11:28:12 | 00:00:44 | make: *** [package] Error 2
| View | View | View | View | View | |||
| Ubuntu-26.04-x86_64 | N/A | 2026/09/ 9 | 03:47:34 | 00:00:03 | View | View | boost-libs>=1.34.1 | ||||||