robotpkg/wip/py-sot-core-v3 bulk build results

py27-sot-core-v3-4.11.8r2 (category wip or summary)

Platform Status Date Time Log files
Start Total bulkcbbhcbbhby
Debian-11-x86_64N/A2026/09/1802:58:1100:00:00ViewView
Debian-12-x86_64N/A2026/09/1807:01:5200:00:00ViewView
Debian-13-x86_64N/A2026/09/1804:36:5500:00:01ViewView
Fedora-42-x86_64N/A2026/09/1808:39:5700:00:01ViewView
Fedora-44-x86_64N/A2026/09/1808:06:3200:00:01ViewView
NetBSD-11-x86_64N/A2026/09/1812:09:2300:00:01ViewView
Rocky-10-x86_64N/A2026/09/1804:55:1400:00:00ViewView
Rocky-8-x86_64N/A2026/09/1802:02:5100:00:00ViewView
Ubuntu-20.04-x86_64N/A2026/09/3021:07:4600:00:09ViewView
boost-libs>=1.34.1
cmake>=3.22
py-sphinx>=1.1
py27-eigenpy-3.5.0
py27-numpy>=1
Ubuntu-22.04-x86_64N/A2026/09/3021:40:4600:00:10ViewView
boost-libs>=1.34.1
py-sphinx>=1.1
py27-eigenpy-3.5.0
py27-numpy>=1
Ubuntu-24.04-x86_64N/A2026/09/1806:49:3000:00:00ViewView
Ubuntu-26.04-x86_64N/A2026/09/1805:18:1900:00:00ViewView

py310-sot-core-v3-4.11.8r2 (category wip or summary)

Platform Status Date Time Log files
Start Total brokenbuildbulkcbbhcmakeconfigureextract
Debian-11-x86_64N/A2026/09/1802:58:1100:00:00ViewView
Debian-12-x86_64N/A2026/09/1807:01:5200:00:01ViewView
Debian-13-x86_64N/A2026/09/1804:36:5600:00:00ViewView
Fedora-42-x86_64N/A2026/09/1808:39:5800:00:01ViewView
Fedora-44-x86_64N/A2026/09/1808:06:3300:00:01ViewView
NetBSD-11-x86_64N/A2026/09/1812:09:2400:00:01ViewView
Rocky-10-x86_64N/A2026/09/1804:55:1500:00:00ViewView
Rocky-8-x86_64N/A2026/09/1802:02:5200:00:00ViewView
Ubuntu-20.04-x86_64N/A2026/09/2119:03:2000:00:00ViewView
Ubuntu-22.04-x86_64Broken2026/09/3021:36:0700:04:38
make: *** [package] Error 2
ViewViewViewViewView
Ubuntu-24.04-x86_64N/A2026/09/1806:49:3000:00:00ViewView
Ubuntu-26.04-x86_64N/A2026/09/1805:18:1900:00:01ViewView

py311-sot-core-v3-4.11.8r2 (category wip or summary)

Platform Status Date Time Log files
Start Total brokenbuildbulkcbbhcmakeconfigureextract
Debian-11-x86_64N/A2026/09/1802:58:1200:00:00ViewView
Debian-12-x86_64Broken2026/09/3021:25:4100:05:23
make: *** [package] Error 2
ViewViewViewViewView
Debian-13-x86_64N/A2026/09/1804:36:5600:00:01ViewView
Fedora-42-x86_64N/A2026/09/1808:39:5900:00:01ViewView
Fedora-44-x86_64N/A2026/09/1808:06:3400:00:01ViewView
NetBSD-11-x86_64N/A2026/09/1812:09:2500:00:01ViewView
Rocky-10-x86_64N/A2026/09/1804:55:1500:00:01ViewView
Rocky-8-x86_64N/A2026/09/1802:02:5200:00:01ViewView
Ubuntu-20.04-x86_64N/A2026/09/2119:03:2000:00:01ViewView
Ubuntu-22.04-x86_64N/A2026/09/1808:06:2700:00:00ViewView
Ubuntu-24.04-x86_64N/A2026/09/1806:49:3100:00:00ViewView
Ubuntu-26.04-x86_64N/A2026/09/1805:18:2000:00:00ViewView

py312-sot-core-v3-4.11.8r2 (category wip or summary)

Platform Status Date Time Log files
Start Total brokenbuildbulkcbbhcmakeconfigureextract
Debian-11-x86_64N/A2026/09/1802:58:1200:00:00ViewView
Debian-12-x86_64N/A2026/09/1807:01:5300:00:00ViewView
Debian-13-x86_64N/A2026/09/1804:36:5700:00:00ViewView
Fedora-42-x86_64N/A2026/09/1808:40:0000:00:01ViewView
Fedora-44-x86_64N/A2026/09/1808:06:3500:00:01ViewView
NetBSD-11-x86_64N/A2026/09/1812:09:2600:00:01ViewView
Rocky-10-x86_64Broken2026/09/3021:11:0900:05:13
make: *** [package] Error 2
ViewViewViewViewView
Rocky-8-x86_64N/A2026/09/1802:02:5300:00:00ViewView
Ubuntu-20.04-x86_64N/A2026/09/2119:03:2100:00:01ViewView
Ubuntu-22.04-x86_64N/A2026/09/1808:06:2800:00:00ViewView
Ubuntu-24.04-x86_64Broken2026/09/3021:28:5400:04:36
make: *** [package] Error 2
ViewViewViewViewView
Ubuntu-26.04-x86_64N/A2026/09/1805:18:2100:00:00ViewView

py313-sot-core-v3-4.11.8r2 (category wip or summary)

Platform Status Date Time Log files
Start Total brokenbrokenbybuildbulkcbbhcmakeconfigureextract
Debian-11-x86_64N/A2026/09/1802:58:1200:00:01ViewView
Debian-12-x86_64N/A2026/09/1807:01:5300:00:01ViewView
Debian-13-x86_64Broken2026/09/3021:39:0600:03:42
make: *** [package] Error 2
ViewViewViewViewView
Fedora-42-x86_64Broken2026/09/3021:24:3000:04:38
make: *** [package] Error 2
ViewViewViewViewView
Fedora-44-x86_64N/A2026/09/1808:06:3600:00:01ViewView
NetBSD-11-x86_64Broken2026/09/3021:53:5700:00:22
Required robotpkg package dynamic-graph-v3>=4.3.0: BROKEN Required robotpkg package py313-dynamic-graph-v3>=4.0.0: BROKEN
View
Rocky-10-x86_64N/A2026/09/1804:59:4500:00:00ViewView
Rocky-8-x86_64N/A2026/09/1802:02:5400:00:00ViewView
Ubuntu-20.04-x86_64N/A2026/09/2119:03:2200:00:01ViewView
Ubuntu-22.04-x86_64N/A2026/09/1808:06:2800:00:01ViewView
Ubuntu-24.04-x86_64N/A2026/09/1806:49:3100:00:00ViewView
Ubuntu-26.04-x86_64N/A2026/09/1805:18:2100:00:01ViewView

py314-sot-core-v3-4.11.8r2 (category wip or summary)

Platform Status Date Time Log files
Start Total brokenbrokenbybulkcbbh
Debian-11-x86_64N/A2026/09/1802:58:1300:00:00ViewView
Debian-12-x86_64N/A2026/09/1807:01:5400:00:00ViewView
Debian-13-x86_64N/A2026/09/1804:36:5700:00:01ViewView
Fedora-42-x86_64N/A2026/09/1808:43:1100:00:01ViewView
Fedora-44-x86_64Broken2026/09/3021:04:0200:00:08
Required robotpkg package dynamic-graph-v3>=4.3.0: BROKEN Required robotpkg package py314-dynamic-graph-v3>=4.0.0: BROKEN
View
NetBSD-11-x86_64N/A2026/09/1812:09:2700:00:01ViewView
Rocky-10-x86_64N/A2026/09/1804:59:4500:00:01ViewView
Rocky-8-x86_64N/A2026/09/1802:02:5400:00:01ViewView
Ubuntu-20.04-x86_64N/A2026/09/2119:03:2300:00:00ViewView
Ubuntu-22.04-x86_64N/A2026/09/1808:06:2900:00:00ViewView
Ubuntu-24.04-x86_64N/A2026/09/1806:49:3200:00:00ViewView
Ubuntu-26.04-x86_64Broken2026/09/3021:06:4200:00:09
Required robotpkg package dynamic-graph-v3>=4.3.0: BROKEN Required robotpkg package py314-dynamic-graph-v3>=4.0.0: BROKEN
View

py36-sot-core-v3-4.11.8r2 (category wip or summary)

Platform Status Date Time Log files
Start Total bulkcbbhcbbhby
Debian-11-x86_64N/A2026/09/1802:58:1300:00:01ViewView
Debian-12-x86_64N/A2026/09/1807:01:5400:00:01ViewView
Debian-13-x86_64N/A2026/09/1804:36:5800:00:00ViewView
Fedora-42-x86_64N/A2026/09/1808:43:1200:00:01ViewView
Fedora-44-x86_64N/A2026/09/1808:06:4900:00:00ViewView
NetBSD-11-x86_64N/A2026/09/1812:09:2900:00:00ViewView
Rocky-10-x86_64N/A2026/09/1804:59:4600:00:00ViewView
Rocky-8-x86_64N/A2026/09/3021:51:2000:00:08ViewView
pinocchio>=3
py36-example-robot-data>=3.6.0
py36-pinocchio>=3.0.0
Ubuntu-20.04-x86_64N/A2026/09/2119:03:2400:00:00ViewView
Ubuntu-22.04-x86_64N/A2026/09/1808:06:3000:00:00ViewView
Ubuntu-24.04-x86_64N/A2026/09/1806:49:3200:00:00ViewView
Ubuntu-26.04-x86_64N/A2026/09/1805:18:2200:00:00ViewView

py38-sot-core-v3-4.11.8r2 (category wip or summary)

Platform Status Date Time Log files
Start Total bulkcbbhcbbhby
Debian-11-x86_64N/A2026/09/1802:58:1400:00:00ViewView
Debian-12-x86_64N/A2026/09/1807:01:5500:00:00ViewView
Debian-13-x86_64N/A2026/09/1804:36:5800:00:01ViewView
Fedora-42-x86_64N/A2026/09/1808:43:1400:00:00ViewView
Fedora-44-x86_64N/A2026/09/1808:06:5000:00:00ViewView
NetBSD-11-x86_64N/A2026/09/1812:09:3000:00:00ViewView
Rocky-10-x86_64N/A2026/09/1804:59:4700:00:00ViewView
Rocky-8-x86_64N/A2026/09/1802:03:0400:00:01ViewView
Ubuntu-20.04-x86_64N/A2026/09/3021:07:5600:00:10ViewView
cmake>=3.22
Ubuntu-22.04-x86_64N/A2026/09/1808:06:3000:00:01ViewView
Ubuntu-24.04-x86_64N/A2026/09/1806:49:3200:00:01ViewView
Ubuntu-26.04-x86_64N/A2026/09/1805:18:2200:00:01ViewView

py39-sot-core-v3-4.11.8r2 (category wip or summary)

Platform Status Date Time Log files
Start Total bulkcbbhcbbhby
Debian-11-x86_64N/A2026/09/3020:54:3900:00:11ViewView
cmake>=3.22
Debian-12-x86_64N/A2026/09/1807:01:5500:00:01ViewView
Debian-13-x86_64N/A2026/09/1804:36:5900:00:00ViewView
Fedora-42-x86_64N/A2026/09/1808:43:1500:00:00ViewView
Fedora-44-x86_64N/A2026/09/1808:06:5100:00:00ViewView
NetBSD-11-x86_64N/A2026/09/1812:09:3100:00:01ViewView
Rocky-10-x86_64N/A2026/09/1804:59:4800:00:00ViewView
Rocky-8-x86_64N/A2026/09/1802:03:0500:00:00ViewView
Ubuntu-20.04-x86_64N/A2026/09/2119:03:3700:00:01ViewView
Ubuntu-22.04-x86_64N/A2026/09/1808:06:3100:00:01ViewView
Ubuntu-24.04-x86_64N/A2026/09/1806:49:3300:00:00ViewView
Ubuntu-26.04-x86_64N/A2026/09/1805:18:2300:00:00ViewView