robotpkg/wip/sot-pattern-generator-v3 bulk build results

sot-pattern-generator-v3-3.4.2 (category wip or summary)

Platform Status Date Time Log files
Start Total brokenbrokenbybuildbulkcbbhcbbhbycmakeconfigureextract
Debian-11-x86_64N/A2026/09/3020:59:3300:00:10ViewView
cmake>=3.22
Debian-12-x86_64Broken2026/09/3021:31:0500:01:01
make: *** [package] Error 2
ViewViewViewViewView
Debian-13-x86_64Broken2026/09/3021:50:0000:00:43
make: *** [package] Error 2
ViewViewViewViewView
Fedora-42-x86_64Broken2026/09/3021:31:0600:01:01
make: *** [package] Error 2
ViewViewViewViewView
Fedora-44-x86_64Broken2026/09/3021:17:1900:00:11
Required robotpkg package dynamic-graph-v3>=4.3.0: BROKEN Required robotpkg package jrl-walkgen-v3>=4.0.0: BROKEN Required robotpkg package py314-sot-core-v3>=4.11.7<5.0.0: BROKEN
View
NetBSD-11-x86_64Broken2026/09/3021:54:2400:00:15
Required robotpkg package dynamic-graph-v3>=4.3.0: BROKEN Required robotpkg package jrl-walkgen-v3>=4.0.0: BROKEN Required robotpkg package py313-sot-core-v3>=4.11.7<5.0.0: BROKEN
View
Rocky-10-x86_64Broken2026/09/3021:17:2900:00:09
Required robotpkg package jrl-walkgen-v3>=4.0.0: BROKEN Required robotpkg package py312-sot-core-v3>=4.11.7<5.0.0: BROKEN
View
Rocky-8-x86_64N/A2026/09/3022:01:4000:00:08ViewView
jrl-walkgen-v3>=4.0.0
pinocchio>=3
py36-sot-core-v3>=4.11.7<5.0.0
Ubuntu-20.04-x86_64N/A2026/09/3021:08:2400:00:10ViewView
cmake>=3.22
py38-sot-core-v3>=4.11.7<5.0.0
Ubuntu-22.04-x86_64Broken2026/09/3021:41:2900:00:57
make: *** [package] Error 2
ViewViewViewViewView
Ubuntu-24.04-x86_64Broken2026/09/3021:33:4400:00:51
make: *** [package] Error 2
ViewViewViewViewView
Ubuntu-26.04-x86_64Broken2026/09/3021:09:4900:00:09
Required robotpkg package dynamic-graph-v3>=4.3.0: BROKEN Required robotpkg package jrl-walkgen-v3>=4.0.0: BROKEN Required robotpkg package py314-sot-core-v3>=4.11.7<5.0.0: BROKEN
View