robotpkg/wip/py-sobec bulk build results

py27-sobec-1.4.0r1 (category wip or summary)

Platform Status Date Time Log files
Start Total bulkcbbhcbbhbysysdep
Debian-11-x86_64N/A2026/09/1206:55:4900:00:00ViewView
Debian-12-x86_64N/A2026/09/1210:27:0500:00:00ViewView
Debian-13-x86_64N/A2026/09/1208:12:4900:00:00ViewView
Fedora-42-x86_64N/A2026/09/1208:32:5900:00:01ViewView
Fedora-44-x86_64N/A2026/09/1214:31:5700:00:00ViewView
NetBSD-10.0-x86_64N/A2026/09/1012:35:2000:00:01ViewView
NetBSD-11-x86_64N/A2026/09/1209:47:3800:00:01ViewView
Rocky-10-x86_64N/A2026/09/1207:07:2400:00:01ViewView
Rocky-8-x86_64N/A2026/09/1205:35:2300:00:01ViewView
Ubuntu-20.04-x86_64Sysdep2026/09/1208:47:5900:00:11ViewView
boost-libs>=1.34.1
cmake>=3.22
py27-eigenpy-3.5.0
py27-matplotlib
py27-numpy>=1
py27-scipy>=0.17.0
View
Ubuntu-22.04-x86_64Sysdep2026/09/1211:13:3800:00:15ViewView
boost-libs>=1.34.1
py27-eigenpy-3.5.0
py27-matplotlib
py27-numpy>=1
py27-scipy>=0.17.0
View
Ubuntu-24.04-x86_64N/A2026/09/1209:35:2600:00:00ViewView
Ubuntu-26.04-x86_64N/A2026/09/1207:03:3000:00:00ViewView

py310-sobec-1.4.0r1 (category wip or summary)

Platform Status Date Time Log files
Start Total brokenbulkcbbhcmakeconfigureextract
Debian-11-x86_64N/A2026/09/1206:55:5000:00:00ViewView
Debian-12-x86_64N/A2026/09/1210:27:0600:00:00ViewView
Debian-13-x86_64N/A2026/09/1208:12:5000:00:00ViewView
Fedora-42-x86_64N/A2026/09/1208:33:0000:00:00ViewView
Fedora-44-x86_64N/A2026/09/1214:31:5800:00:00ViewView
NetBSD-10.0-x86_64N/A2026/09/1012:35:2100:00:01ViewView
NetBSD-11-x86_64N/A2026/09/1209:47:3900:00:00ViewView
Rocky-10-x86_64N/A2026/09/1207:07:2500:00:00ViewView
Rocky-8-x86_64N/A2026/09/1205:35:2400:00:00ViewView
Ubuntu-20.04-x86_64N/A2026/09/1208:48:1000:00:00ViewView
Ubuntu-22.04-x86_64Broken2026/09/1211:13:5400:00:23
make: *** [package] Error 2
ViewViewViewView
Ubuntu-24.04-x86_64N/A2026/09/1209:35:2700:00:00ViewView
Ubuntu-26.04-x86_64N/A2026/09/1207:03:3000:00:00ViewView

py311-sobec-1.4.0r1 (category wip or summary)

Platform Status Date Time Log files
Start Total brokenbulkcbbhcmakeconfigureextract
Debian-11-x86_64N/A2026/09/1206:55:5000:00:00ViewView
Debian-12-x86_64Broken2026/09/1210:27:0600:00:19
make: *** [package] Error 2
ViewViewViewView
Debian-13-x86_64N/A2026/09/1208:12:5000:00:01ViewView
Fedora-42-x86_64N/A2026/09/1208:33:0000:00:01ViewView
Fedora-44-x86_64N/A2026/09/1214:31:5900:00:00ViewView
NetBSD-10.0-x86_64Broken2026/09/1012:35:2200:00:34
/usr/pkg/bin/gmake: *** [package] Error 2
ViewViewViewView
NetBSD-11-x86_64N/A2026/09/1209:47:4000:00:00ViewView
Rocky-10-x86_64N/A2026/09/1207:07:2600:00:00ViewView
Rocky-8-x86_64N/A2026/09/1205:35:2400:00:01ViewView
Ubuntu-20.04-x86_64N/A2026/09/1208:48:1100:00:00ViewView
Ubuntu-22.04-x86_64N/A2026/09/1211:14:1700:00:01ViewView
Ubuntu-24.04-x86_64N/A2026/09/1209:35:2800:00:00ViewView
Ubuntu-26.04-x86_64N/A2026/09/1207:03:3100:00:00ViewView

py312-sobec-1.4.0r1 (category wip or summary)

Platform Status Date Time Log files
Start Total brokenbulkcbbhcmakeconfigureextract
Debian-11-x86_64N/A2026/09/1206:55:5000:00:01ViewView
Debian-12-x86_64N/A2026/09/1210:27:2600:00:00ViewView
Debian-13-x86_64N/A2026/09/1208:12:5100:00:00ViewView
Fedora-42-x86_64N/A2026/09/1208:33:0100:00:01ViewView
Fedora-44-x86_64N/A2026/09/1214:32:0000:00:00ViewView
NetBSD-10.0-x86_64N/A2026/09/1012:35:5600:00:01ViewView
NetBSD-11-x86_64N/A2026/09/1209:47:4100:00:00ViewView
Rocky-10-x86_64Broken2026/09/1207:07:2700:00:19
make: *** [package] Error 2
ViewViewViewView
Rocky-8-x86_64N/A2026/09/1205:35:2500:00:00ViewView
Ubuntu-20.04-x86_64N/A2026/09/1208:48:1100:00:01ViewView
Ubuntu-22.04-x86_64N/A2026/09/1211:14:1800:00:00ViewView
Ubuntu-24.04-x86_64Broken2026/09/1209:35:2800:00:21
make: *** [package] Error 2
ViewViewViewView
Ubuntu-26.04-x86_64N/A2026/09/1207:03:3100:00:01ViewView

py313-sobec-1.4.0r1 (category wip or summary)

Platform Status Date Time Log files
Start Total brokenbrokenbybulkcbbh
Debian-11-x86_64N/A2026/09/1206:55:5100:00:00ViewView
Debian-12-x86_64N/A2026/09/1210:27:2600:00:01ViewView
Debian-13-x86_64Broken2026/09/1208:12:5100:00:10
Required robotpkg package py313-bullet3>=3.24: BROKEN
View
Fedora-42-x86_64Broken2026/09/1208:33:0200:00:09
Required robotpkg package py313-bullet3>=3.24: BROKEN
View
Fedora-44-x86_64N/A2026/09/1214:32:0000:00:01ViewView
NetBSD-10.0-x86_64N/A2026/09/1012:35:5700:00:01ViewView
NetBSD-11-x86_64Broken2026/09/1209:47:4200:00:21
Required robotpkg package py313-bullet3>=3.24: BROKEN
View
Rocky-10-x86_64N/A2026/09/1207:07:4600:00:00ViewView
Rocky-8-x86_64N/A2026/09/1205:35:2500:00:00ViewView
Ubuntu-20.04-x86_64N/A2026/09/1208:48:1200:00:00ViewView
Ubuntu-22.04-x86_64N/A2026/09/1211:14:1900:00:00ViewView
Ubuntu-24.04-x86_64N/A2026/09/1209:35:5000:00:00ViewView
Ubuntu-26.04-x86_64N/A2026/09/1207:03:3200:00:00ViewView

py314-sobec-1.4.0r1 (category wip or summary)

Platform Status Date Time Log files
Start Total brokenbrokenbybulkcbbh
Debian-11-x86_64N/A2026/09/1206:55:5100:00:00ViewView
Debian-12-x86_64N/A2026/09/1210:27:2700:00:00ViewView
Debian-13-x86_64N/A2026/09/1208:13:0200:00:00ViewView
Fedora-42-x86_64N/A2026/09/1208:33:1100:00:01ViewView
Fedora-44-x86_64Broken2026/09/1214:32:0100:00:11
Required robotpkg package py314-bullet3>=3.24: BROKEN
View
NetBSD-10.0-x86_64N/A2026/09/1012:35:5800:00:00ViewView
NetBSD-11-x86_64N/A2026/09/1209:48:0400:00:00ViewView
Rocky-10-x86_64N/A2026/09/1207:07:4700:00:00ViewView
Rocky-8-x86_64N/A2026/09/1205:35:2600:00:00ViewView
Ubuntu-20.04-x86_64N/A2026/09/1208:48:1300:00:00ViewView
Ubuntu-22.04-x86_64N/A2026/09/1211:14:1900:00:01ViewView
Ubuntu-24.04-x86_64N/A2026/09/1209:35:5000:00:01ViewView
Ubuntu-26.04-x86_64Broken2026/09/1207:03:3300:00:10
Required robotpkg package py314-bullet3>=3.24: BROKEN
View

py36-sobec-1.4.0r1 (category wip or summary)

Platform Status Date Time Log files
Start Total brokenbuildbulkcbbhcmakeconfigureextract
Debian-11-x86_64N/A2026/09/1206:55:5200:00:00ViewView
Debian-12-x86_64N/A2026/09/1210:27:2800:00:00ViewView
Debian-13-x86_64N/A2026/09/1208:13:0200:00:01ViewView
Fedora-42-x86_64N/A2026/09/1208:33:1200:00:00ViewView
Fedora-44-x86_64N/A2026/09/1214:32:1300:00:00ViewView
NetBSD-10.0-x86_64N/A2026/09/1012:35:5900:00:00ViewView
NetBSD-11-x86_64N/A2026/09/1209:48:0500:00:01ViewView
Rocky-10-x86_64N/A2026/09/1207:07:4700:00:01ViewView
Rocky-8-x86_64Broken2026/09/1205:35:2600:09:14
make: *** [package] Error 2
ViewViewViewViewView
Ubuntu-20.04-x86_64N/A2026/09/1208:48:1300:00:00ViewView
Ubuntu-22.04-x86_64N/A2026/09/1211:14:2000:00:00ViewView
Ubuntu-24.04-x86_64N/A2026/09/1209:35:5100:00:00ViewView
Ubuntu-26.04-x86_64N/A2026/09/1207:03:4400:00:00ViewView

py38-sobec-1.4.0r1 (category wip or summary)

Platform Status Date Time Log files
Start Total bulkcbbhcbbhby
Debian-11-x86_64N/A2026/09/1206:55:5200:00:00ViewView
Debian-12-x86_64N/A2026/09/1210:27:2800:00:00ViewView
Debian-13-x86_64N/A2026/09/1208:13:0300:00:00ViewView
Fedora-42-x86_64N/A2026/09/1208:33:1300:00:00ViewView
Fedora-44-x86_64N/A2026/09/1214:32:1400:00:00ViewView
NetBSD-10.0-x86_64N/A2026/09/1012:35:5900:00:01ViewView
NetBSD-11-x86_64N/A2026/09/1209:48:0600:00:00ViewView
Rocky-10-x86_64N/A2026/09/1207:07:4800:00:00ViewView
Rocky-8-x86_64N/A2026/09/1205:44:4000:00:00ViewView
Ubuntu-20.04-x86_64N/A2026/09/1208:48:1300:00:13ViewView
cmake>=3.22
Ubuntu-22.04-x86_64N/A2026/09/1211:14:2100:00:00ViewView
Ubuntu-24.04-x86_64N/A2026/09/1209:35:5200:00:00ViewView
Ubuntu-26.04-x86_64N/A2026/09/1207:03:4500:00:00ViewView

py39-sobec-1.4.0r1 (category wip or summary)

Platform Status Date Time Log files
Start Total bulkcbbhcbbhby
Debian-11-x86_64N/A2026/09/1206:55:5300:00:09ViewView
cmake>=3.22
Debian-12-x86_64N/A2026/09/1210:27:2900:00:00ViewView
Debian-13-x86_64N/A2026/09/1208:13:0400:00:00ViewView
Fedora-42-x86_64N/A2026/09/1208:33:1300:00:01ViewView
Fedora-44-x86_64N/A2026/09/1214:32:1500:00:00ViewView
NetBSD-10.0-x86_64N/A2026/09/1012:36:0000:00:00ViewView
NetBSD-11-x86_64N/A2026/09/1209:48:0700:00:01ViewView
Rocky-10-x86_64N/A2026/09/1207:07:4900:00:00ViewView
Rocky-8-x86_64N/A2026/09/1205:44:4100:00:00ViewView
Ubuntu-20.04-x86_64N/A2026/09/1208:48:2600:00:01ViewView
Ubuntu-22.04-x86_64N/A2026/09/1211:14:2200:00:00ViewView
Ubuntu-24.04-x86_64N/A2026/09/1209:35:5200:00:01ViewView
Ubuntu-26.04-x86_64N/A2026/09/1207:03:4500:00:01ViewView