robotpkg/wip/py-sobec bulk build results

Log for py39-sobec-1.4.0r1 on Debian-11-x86_64: bulk.log (Back)

=> Checking for clear installation ===> Installing bootstrap dependencies for py39-sobec-1.4.0r1 => Installing /opt/robotpkg/var/lib/robotpkg/packages/bsd/Debian-11-x86_64/All/digest-20080510.tgz => Installing /opt/robotpkg/var/lib/robotpkg/packages/bsd/Debian-11-x86_64/All/tnftp-20151004~ssl.tgz ===> Checking bootstrap dependencies for py39-sobec-1.4.0r1 => Required robotpkg package digest>=20080510: digest-20080510 found => Required robotpkg package tnftp>=20130505~ssl: tnftp-20151004~ssl found => Required system package gnupg>=1: gnupg-2.2.27 found => Required system package gzip: gzip-1.10 found => Required system package patch>=2.0: patch-2.7.6 found => Required system package pax and tar archivers: pax found => Required system package pkg_install>=20110805.12: pkg_install-20211115.3 found => Required system package pkgrepo2deb>=1.9: pkgrepo2deb-1.13 found ===> Done bootstrap-depends for py39-sobec-1.4.0r1 ===> Installing full dependencies for py39-sobec-1.4.0r1 => Dependency digest-20080510 already installed => Installing /opt/robotpkg/var/lib/robotpkg/packages/bsd/Debian-11-x86_64/All/ndcurves-1.4.1.tgz => Installing /opt/robotpkg/var/lib/robotpkg/wip/packages/bsd/Debian-11-x86_64/All/py39-bullet3-3.24r1.tgz => Installing /opt/robotpkg/var/lib/robotpkg/packages/bsd/Debian-11-x86_64/All/py39-crocoddyl-2.0.2.tgz => Dependency py39-eigenpy-3.5.0 already installed => Installing /opt/robotpkg/var/lib/robotpkg/packages/bsd/Debian-11-x86_64/All/py39-ndcurves-1.4.1.tgz => Dependency tnftp-20151004~ssl already installed ===> Checking build options for py39-sobec-1.4.0r1 => Building with no option. ===> Checking alternatives for py39-sobec-1.4.0r1 => Use the GNU C++ compiler: c++-compiler provided by g++>=3 => Use the GNU C compiler: c-compiler provided by gcc>=3 => Use python-3.9: python>=2.5 provided by python39>=3.9<3.10 ===> Checking dependencies for py39-sobec-1.4.0r1 => Required system package boost-headers>=1.34.1: boost-headers-1.74 found => Required system package boostlib-python>=1.34.1: boost-libs-1.74.0 found => Required system package boostlib-unit_test_framework>=1.34.1: boost-libs-1.74.0 found => Required system package cmake>=3.1.0: cmake-3.18.4 found => Required system package eigen3>=3.0.0: eigen3-3.3.9 found => Required system package g++>=3: g++-10 found => Required system package gcc>=3: gcc-10 found => Required system package libstdc++: libstdc++ found => Required system package pkg-config>=0.22: pkg-config-0.29.2 found => Required system package py39-matplotlib: py39-matplotlib~wx found => Required system package py39-numpy>=1: py39-numpy-1.19.5 found => Required system package python39>=3.9<3.10: python39-3.9.2 found => Required system package yaml-cpp>=0.5: yaml-cpp-0.6.3 found => Required robotpkg package ndcurves>=0.3.3: ndcurves-1.4.1 found => Required robotpkg package py39-bullet3>=3.24: py39-bullet3-3.24r1 found => Required robotpkg package py39-crocoddyl>=0.9.0: py39-crocoddyl-2.0.2 found => Required robotpkg package py39-eigenpy>=2.7.10: py39-eigenpy-3.5.0 found => Required robotpkg package py39-ndcurves>=1.0.0: py39-ndcurves-1.4.1 found ===> Done depends for py39-sobec-1.4.0r1 ===> Extracting for py39-sobec-1.4.0r1 => SHA1 checksums OK => RMD160 checksums OK ===> Patching for py39-sobec-1.4.0r1 => Applying robotpkg patches for py39-sobec-1.4.0r1 ===> Configuring for py39-sobec-1.4.0r1 CMake Warning at /usr/share/cmake-3.18/Modules/FindBoost.cmake:1187 (message): New Boost version may have incorrect or missing dependencies and imported targets Call Stack (most recent call first): /usr/share/cmake-3.18/Modules/FindBoost.cmake:1311 (_Boost_COMPONENT_DEPENDENCIES) /usr/share/cmake-3.18/Modules/FindBoost.cmake:1919 (_Boost_MISSING_DEPENDENCIES) /opt/openrobots/lib/cmake/eigenpy/boost.cmake:144 (find_package) /opt/openrobots/lib/cmake/eigenpy/eigenpyConfig.cmake:149 (SEARCH_FOR_BOOST_PYTHON) cmake/package-config.cmake:110 (find_package) CMakeLists.txt:47 (add_project_dependency) CMake Warning at /usr/share/cmake-3.18/Modules/FindBoost.cmake:1187 (message): New Boost version may have incorrect or missing dependencies and imported targets Call Stack (most recent call first): /usr/share/cmake-3.18/Modules/FindBoost.cmake:1311 (_Boost_COMPONENT_DEPENDENCIES) /usr/share/cmake-3.18/Modules/FindBoost.cmake:1919 (_Boost_MISSING_DEPENDENCIES) /usr/share/cmake-3.18/Modules/CMakeFindDependencyMacro.cmake:47 (find_package) /opt/openrobots/lib/cmake/pinocchio/pinocchioConfig.cmake:158 (find_dependency) /usr/share/cmake-3.18/Modules/CMakeFindDependencyMacro.cmake:47 (find_package) /opt/openrobots/lib/cmake/ndcurves/ndcurvesConfig.cmake:148 (find_dependency) cmake/package-config.cmake:110 (find_package) CMakeLists.txt:52 (add_project_dependency) CMake Warning at /usr/share/cmake-3.18/Modules/FindBoost.cmake:1187 (message): New Boost version may have incorrect or missing dependencies and imported targets Call Stack (most recent call first): /usr/share/cmake-3.18/Modules/FindBoost.cmake:1311 (_Boost_COMPONENT_DEPENDENCIES) /usr/share/cmake-3.18/Modules/FindBoost.cmake:1919 (_Boost_MISSING_DEPENDENCIES) /usr/share/cmake-3.18/Modules/CMakeFindDependencyMacro.cmake:47 (find_package) /opt/openrobots/lib/cmake/pinocchio/pinocchioConfig.cmake:158 (find_dependency) /usr/share/cmake-3.18/Modules/CMakeFindDependencyMacro.cmake:47 (find_package) /opt/openrobots/lib/cmake/ndcurves/ndcurvesConfig.cmake:148 (find_dependency) cmake/package-config.cmake:110 (find_package) CMakeLists.txt:52 (add_project_dependency) CMake Warning at /usr/share/cmake-3.18/Modules/FindBoost.cmake:1187 (message): New Boost version may have incorrect or missing dependencies and imported targets Call Stack (most recent call first): /usr/share/cmake-3.18/Modules/FindBoost.cmake:1311 (_Boost_COMPONENT_DEPENDENCIES) /usr/share/cmake-3.18/Modules/FindBoost.cmake:1919 (_Boost_MISSING_DEPENDENCIES) /usr/share/cmake-3.18/Modules/CMakeFindDependencyMacro.cmake:47 (find_package) /opt/openrobots/lib/cmake/pinocchio/pinocchioConfig.cmake:158 (find_dependency) /usr/share/cmake-3.18/Modules/CMakeFindDependencyMacro.cmake:47 (find_package) /opt/openrobots/lib/cmake/ndcurves/ndcurvesConfig.cmake:148 (find_dependency) cmake/package-config.cmake:110 (find_package) CMakeLists.txt:52 (add_project_dependency) CMake Warning at /usr/share/cmake-3.18/Modules/FindBoost.cmake:1187 (message): New Boost version may have incorrect or missing dependencies and imported targets Call Stack (most recent call first): /usr/share/cmake-3.18/Modules/FindBoost.cmake:1311 (_Boost_COMPONENT_DEPENDENCIES) /usr/share/cmake-3.18/Modules/FindBoost.cmake:1919 (_Boost_MISSING_DEPENDENCIES) /usr/share/cmake-3.18/Modules/CMakeFindDependencyMacro.cmake:47 (find_package) /opt/openrobots/lib/cmake/hpp-fcl/hpp-fclConfig.cmake:154 (find_dependency) /usr/share/cmake-3.18/Modules/CMakeFindDependencyMacro.cmake:47 (find_package) /opt/openrobots/lib/cmake/pinocchio/pinocchioConfig.cmake:159 (find_dependency) /usr/share/cmake-3.18/Modules/CMakeFindDependencyMacro.cmake:47 (find_package) /opt/openrobots/lib/cmake/ndcurves/ndcurvesConfig.cmake:148 (find_dependency) cmake/package-config.cmake:110 (find_package) CMakeLists.txt:52 (add_project_dependency) CMake Warning at /usr/share/cmake-3.18/Modules/FindBoost.cmake:1187 (message): New Boost version may have incorrect or missing dependencies and imported targets Call Stack (most recent call first): /usr/share/cmake-3.18/Modules/FindBoost.cmake:1311 (_Boost_COMPONENT_DEPENDENCIES) /usr/share/cmake-3.18/Modules/FindBoost.cmake:1919 (_Boost_MISSING_DEPENDENCIES) /usr/share/cmake-3.18/Modules/CMakeFindDependencyMacro.cmake:47 (find_package) /opt/openrobots/lib/cmake/hpp-fcl/hpp-fclConfig.cmake:154 (find_dependency) /usr/share/cmake-3.18/Modules/CMakeFindDependencyMacro.cmake:47 (find_package) /opt/openrobots/lib/cmake/pinocchio/pinocchioConfig.cmake:159 (find_dependency) /usr/share/cmake-3.18/Modules/CMakeFindDependencyMacro.cmake:47 (find_package) /opt/openrobots/lib/cmake/ndcurves/ndcurvesConfig.cmake:148 (find_dependency) cmake/package-config.cmake:110 (find_package) CMakeLists.txt:52 (add_project_dependency) CMake Warning at /usr/share/cmake-3.18/Modules/FindBoost.cmake:1187 (message): New Boost version may have incorrect or missing dependencies and imported targets Call Stack (most recent call first): /usr/share/cmake-3.18/Modules/FindBoost.cmake:1311 (_Boost_COMPONENT_DEPENDENCIES) /usr/share/cmake-3.18/Modules/FindBoost.cmake:1919 (_Boost_MISSING_DEPENDENCIES) /usr/share/cmake-3.18/Modules/CMakeFindDependencyMacro.cmake:47 (find_package) /opt/openrobots/lib/cmake/hpp-fcl/hpp-fclConfig.cmake:154 (find_dependency) /usr/share/cmake-3.18/Modules/CMakeFindDependencyMacro.cmake:47 (find_package) /opt/openrobots/lib/cmake/pinocchio/pinocchioConfig.cmake:159 (find_dependency) /usr/share/cmake-3.18/Modules/CMakeFindDependencyMacro.cmake:47 (find_package) /opt/openrobots/lib/cmake/ndcurves/ndcurvesConfig.cmake:148 (find_dependency) cmake/package-config.cmake:110 (find_package) CMakeLists.txt:52 (add_project_dependency) CMake Warning at /usr/share/cmake-3.18/Modules/FindBoost.cmake:1187 (message): New Boost version may have incorrect or missing dependencies and imported targets Call Stack (most recent call first): /usr/share/cmake-3.18/Modules/FindBoost.cmake:1311 (_Boost_COMPONENT_DEPENDENCIES) /usr/share/cmake-3.18/Modules/FindBoost.cmake:1919 (_Boost_MISSING_DEPENDENCIES) /usr/share/cmake-3.18/Modules/CMakeFindDependencyMacro.cmake:47 (find_package) /opt/openrobots/lib/cmake/ndcurves/ndcurvesConfig.cmake:149 (find_dependency) cmake/package-config.cmake:110 (find_package) CMakeLists.txt:52 (add_project_dependency) CMake Warning at /usr/share/cmake-3.18/Modules/FindBoost.cmake:1187 (message): New Boost version may have incorrect or missing dependencies and imported targets Call Stack (most recent call first): /usr/share/cmake-3.18/Modules/FindBoost.cmake:1311 (_Boost_COMPONENT_DEPENDENCIES) /usr/share/cmake-3.18/Modules/FindBoost.cmake:1919 (_Boost_MISSING_DEPENDENCIES) /usr/share/cmake-3.18/Modules/CMakeFindDependencyMacro.cmake:47 (find_package) /opt/openrobots/lib/cmake/crocoddyl/crocoddylConfig.cmake:157 (find_dependency) cmake/package-config.cmake:110 (find_package) CMakeLists.txt:53 (add_project_dependency) CMake Warning at /usr/share/cmake-3.18/Modules/FindBoost.cmake:1187 (message): New Boost version may have incorrect or missing dependencies and imported targets Call Stack (most recent call first): /usr/share/cmake-3.18/Modules/FindBoost.cmake:1311 (_Boost_COMPONENT_DEPENDENCIES) /usr/share/cmake-3.18/Modules/FindBoost.cmake:1919 (_Boost_MISSING_DEPENDENCIES) /usr/share/cmake-3.18/Modules/CMakeFindDependencyMacro.cmake:47 (find_package) /opt/openrobots/lib/cmake/crocoddyl/crocoddylConfig.cmake:157 (find_dependency) cmake/package-config.cmake:110 (find_package) CMakeLists.txt:53 (add_project_dependency) CMake Warning at /usr/share/cmake-3.18/Modules/FindBoost.cmake:1187 (message): New Boost version may have incorrect or missing dependencies and imported targets Call Stack (most recent call first): /usr/share/cmake-3.18/Modules/FindBoost.cmake:1311 (_Boost_COMPONENT_DEPENDENCIES) /usr/share/cmake-3.18/Modules/FindBoost.cmake:1919 (_Boost_MISSING_DEPENDENCIES) /usr/share/cmake-3.18/Modules/CMakeFindDependencyMacro.cmake:47 (find_package) /opt/openrobots/lib/cmake/crocoddyl/crocoddylConfig.cmake:157 (find_dependency) cmake/package-config.cmake:110 (find_package) CMakeLists.txt:53 (add_project_dependency) CMake Warning at /usr/share/cmake-3.18/Modules/FindBoost.cmake:1187 (message): New Boost version may have incorrect or missing dependencies and imported targets Call Stack (most recent call first): /usr/share/cmake-3.18/Modules/FindBoost.cmake:1311 (_Boost_COMPONENT_DEPENDENCIES) /usr/share/cmake-3.18/Modules/FindBoost.cmake:1919 (_Boost_MISSING_DEPENDENCIES) CMakeLists.txt:150 (find_package) ===> Building for py39-sobec-1.4.0r1 In file included from /local/robotpkg/var/tmp/robotpkg/wip/py-sobec/work/sobec-1.4.0/include/sobec/walk-with-traj/model_factory.hpp:10, from /local/robotpkg/var/tmp/robotpkg/wip/py-sobec/work/sobec-1.4.0/src/walk-with-traj/model_factory.cpp:1: /local/robotpkg/var/tmp/robotpkg/wip/py-sobec/work/sobec-1.4.0/include/sobec/fwd.hpp:27:10: fatal error: crocoddyl/multibody/frames.hpp: No such file or directory 27 | #include | ^~~~~~~~~~~~~~~~~~~~~~~~~~~~~~~~ compilation terminated. make[2]: *** [CMakeFiles/sobec.dir/build.make:98: CMakeFiles/sobec.dir/src/walk-with-traj/model_factory.cpp.o] Error 1 make[1]: *** [CMakeFiles/Makefile2:512: CMakeFiles/sobec.dir/all] Error 2 make: *** [Makefile:163: all] Error 2 An unexpected error occured. The last 10 log lines are shown below. | from /local/robotpkg/var/tmp/robotpkg/wip/py-sobec/work/sobec-1.4.0/src/walk-with-traj/model_factory.cpp:1: | /local/robotpkg/var/tmp/robotpkg/wip/py-sobec/work/sobec-1.4.0/include/sobec/fwd.hpp:27:10: fatal error: crocoddyl/multibody/frames.hpp: No such file or directory | 27 | #include | | ^~~~~~~~~~~~~~~~~~~~~~~~~~~~~~~~ | compilation terminated. | make[2]: *** [CMakeFiles/sobec.dir/build.make:98: CMakeFiles/sobec.dir/src/walk-with-traj/model_factory.cpp.o] Error 1 | make[2]: Leaving directory '/local/robotpkg/var/tmp/robotpkg/wip/py-sobec/work/sobec-1.4.0' | make[1]: *** [CMakeFiles/Makefile2:512: CMakeFiles/sobec.dir/all] Error 2 | make[1]: Leaving directory '/local/robotpkg/var/tmp/robotpkg/wip/py-sobec/work/sobec-1.4.0' | make: *** [Makefile:163: all] Error 2 For details or bug reports, check the complete log file in: /local/robotpkg/var/tmp/robotpkg/wip/py-sobec/work/build.log make[3]: *** [/local/robotpkg/var/lib/robotpkg/mk/build/build.mk:204: do-build-make(/local/robotpkg/var/tmp/robotpkg/wip/py-sobec/work/sobec-1.4.0)] Error 2 make[2]: *** [/local/robotpkg/var/lib/robotpkg/mk/pkg/package.mk:42: pkg-check-installed] Error 2 => Marking py39-sobec-1.4.0r1 as broken ERROR: make: *** [package] Error 2 ===> Deinstalling for py39-sobec Removed digest-20080510 Removing dependency hpp-fcl-2.4.4~doc Removing dependency pinocchio-2.7.0 Removing dependency Removing dependency py39-ndcurves-1.4.1 Removed ndcurves-1.4.1 Removed py39-bullet3-3.24r1 Removing dependency example-robot-data-4.1.0 Removing dependency hpp-fcl-2.4.4~doc Removing dependency pinocchio-2.7.0 Removing dependency py39-eigenpy-3.5.0 Removing dependency py39-example-robot-data-4.1.0 Removing dependency py39-pinocchio-2.7.0 Removing dependency Removed py39-crocoddyl-2.0.2 Removed tnftp-20151004~ssl