robotpkg/wip/py-sobec bulk build results

Log for py312-sobec-1.4.0r1 on Rocky-10-x86_64: bulk.log (Back)

=> Checking for clear installation ===> Installing bootstrap dependencies for py312-sobec-1.4.0r1 => Installing /opt/robotpkg/var/lib/robotpkg/packages/bsd/Rocky-10-x86_64/All/digest-20080510.tgz => Installing /opt/robotpkg/var/lib/robotpkg/packages/bsd/Rocky-10-x86_64/All/tnftp-20151004~ssl.tgz ===> Checking bootstrap dependencies for py312-sobec-1.4.0r1 => Required robotpkg package digest>=20080510: digest-20080510 found => Required robotpkg package tnftp>=20130505~ssl: tnftp-20151004~ssl found => Required system package gzip: gzip-1.13 found => Required system package patch>=2.0: patch-2.7.6~posix found => Required system package pax and tar archivers: pax found => Required system package pkg_install>=20110805.12: pkg_install-20211115.4 found ===> Done bootstrap-depends for py312-sobec-1.4.0r1 ===> Installing full dependencies for py312-sobec-1.4.0r1 => Dependency digest-20080510 already installed => Installing /opt/robotpkg/var/lib/robotpkg/packages/bsd/Rocky-10-x86_64/All/jrl-cmakemodules-2.1.0.tgz => Installing /opt/robotpkg/var/lib/robotpkg/packages/bsd/Rocky-10-x86_64/All/ndcurves-2.3.0.tgz => Installing /opt/robotpkg/var/lib/robotpkg/wip/packages/bsd/Rocky-10-x86_64/All/py312-bullet3-3.24r1.tgz => Installing /opt/robotpkg/var/lib/robotpkg/packages/bsd/Rocky-10-x86_64/All/py312-crocoddyl-3.2.1r1.tgz => Dependency py312-eigenpy-3.13.0 already installed => Installing /opt/robotpkg/var/lib/robotpkg/packages/bsd/Rocky-10-x86_64/All/py312-ndcurves-2.3.0.tgz => Dependency tnftp-20151004~ssl already installed ===> Checking build options for py312-sobec-1.4.0r1 => Building with no option. ===> Checking alternatives for py312-sobec-1.4.0r1 => Use the GNU C++ compiler: c++-compiler provided by g++>=3 => Use the GNU C compiler: c-compiler provided by gcc>=3 => Use python-3.12: python>=2.5 provided by python312>=3.12<3.13 ===> Checking dependencies for py312-sobec-1.4.0r1 => Required system package boost-headers>=1.34.1: boost-headers-1.83 found => Required system package boostlib-python>=1.34.1: boost-libs-1.83.0 found => Required system package boostlib-unit_test_framework>=1.34.1: boost-libs-1.83.0 found => Required system package cmake>=3.10: cmake-3.31.8 found => Required system package eigen3>=3.3: eigen3-3.4.0 found => Required system package g++>=3: g++-14.3.1 found => Required system package gcc>=3: gcc-14.3.1 found => Required system package libstdc++: libstdc++ found => Required system package pkg-config>=0.22: pkg-config-2.1.0 found => Required system package py312-matplotlib: py312-matplotlib found => Required system package py312-numpy>=1: py312-numpy-1.26.4 found => Required system package python312>=3.12<3.13: python312-3.12.14 found => Required system package yaml-cpp>=0.5: yaml-cpp-0.8.0 found => Required robotpkg package jrl-cmakemodules>=1.1.0: jrl-cmakemodules-2.1.0 found => Required robotpkg package ndcurves>=0.3.3: ndcurves-2.3.0 found => Required robotpkg package py312-bullet3>=3.24: py312-bullet3-3.24r1 found => Required robotpkg package py312-crocoddyl>=0.9.0: py312-crocoddyl-3.2.1r1 found => Required robotpkg package py312-eigenpy>=2.7.10: py312-eigenpy-3.13.0 found => Required robotpkg package py312-ndcurves>=1.0.0: py312-ndcurves-2.3.0 found ===> Done depends for py312-sobec-1.4.0r1 ===> Extracting for py312-sobec-1.4.0r1 => SHA1 checksums OK => RMD160 checksums OK ===> Patching for py312-sobec-1.4.0r1 => Applying robotpkg patches for py312-sobec-1.4.0r1 ===> Configuring for py312-sobec-1.4.0r1 CMake Warning (dev) at /opt/openrobots/lib/cmake/eigenpy/boost.cmake:146 (find_package): Policy CMP0167 is not set: The FindBoost module is removed. Run "cmake --help-policy CMP0167" for policy details. Use the cmake_policy command to set the policy and suppress this warning. Call Stack (most recent call first): /opt/openrobots/lib/cmake/eigenpy/eigenpyConfig.cmake:175 (SEARCH_FOR_BOOST_PYTHON) cmake/package-config.cmake:110 (find_package) CMakeLists.txt:47 (add_project_dependency) This warning is for project developers. Use -Wno-dev to suppress it. CMake Warning (dev) at /usr/share/cmake/Modules/CMakeFindDependencyMacro.cmake:76 (find_package): Policy CMP0167 is not set: The FindBoost module is removed. Run "cmake --help-policy CMP0167" for policy details. Use the cmake_policy command to set the policy and suppress this warning. Call Stack (most recent call first): /opt/openrobots/lib/cmake/pinocchio/pinocchioConfig.cmake:185 (find_dependency) /usr/share/cmake/Modules/CMakeFindDependencyMacro.cmake:76 (find_package) /opt/openrobots/lib/cmake/ndcurves/ndcurvesConfig.cmake:173 (find_dependency) cmake/package-config.cmake:110 (find_package) CMakeLists.txt:52 (add_project_dependency) This warning is for project developers. Use -Wno-dev to suppress it. CMake Warning (dev) at /usr/share/cmake/Modules/CMakeFindDependencyMacro.cmake:76 (find_package): Policy CMP0167 is not set: The FindBoost module is removed. Run "cmake --help-policy CMP0167" for policy details. Use the cmake_policy command to set the policy and suppress this warning. Call Stack (most recent call first): /opt/openrobots/lib/cmake/coal/coalConfig.cmake:179 (find_dependency) /usr/share/cmake/Modules/CMakeFindDependencyMacro.cmake:76 (find_package) /opt/openrobots/lib/cmake/pinocchio/pinocchioConfig.cmake:186 (find_dependency) /usr/share/cmake/Modules/CMakeFindDependencyMacro.cmake:76 (find_package) /opt/openrobots/lib/cmake/ndcurves/ndcurvesConfig.cmake:173 (find_dependency) cmake/package-config.cmake:110 (find_package) CMakeLists.txt:52 (add_project_dependency) This warning is for project developers. Use -Wno-dev to suppress it. CMake Warning (dev) at /usr/share/cmake/Modules/CMakeFindDependencyMacro.cmake:76 (find_package): Policy CMP0167 is not set: The FindBoost module is removed. Run "cmake --help-policy CMP0167" for policy details. Use the cmake_policy command to set the policy and suppress this warning. Call Stack (most recent call first): /opt/openrobots/lib/cmake/ndcurves/ndcurvesConfig.cmake:174 (find_dependency) cmake/package-config.cmake:110 (find_package) CMakeLists.txt:52 (add_project_dependency) This warning is for project developers. Use -Wno-dev to suppress it. CMake Warning (dev) at /usr/share/cmake/Modules/CMakeFindDependencyMacro.cmake:76 (find_package): Policy CMP0167 is not set: The FindBoost module is removed. Run "cmake --help-policy CMP0167" for policy details. Use the cmake_policy command to set the policy and suppress this warning. Call Stack (most recent call first): /opt/openrobots/lib/cmake/crocoddyl/crocoddylConfig.cmake:178 (find_dependency) cmake/package-config.cmake:110 (find_package) CMakeLists.txt:53 (add_project_dependency) This warning is for project developers. Use -Wno-dev to suppress it. CMake Warning (dev) at CMakeLists.txt:150 (find_package): Policy CMP0167 is not set: The FindBoost module is removed. Run "cmake --help-policy CMP0167" for policy details. Use the cmake_policy command to set the policy and suppress this warning. This warning is for project developers. Use -Wno-dev to suppress it. CMake Error at tests/CMakeLists.txt:25 (target_link_libraries): Target "sobec_unittest" links to: example-robot-data::example-robot-data but the target was not found. Possible reasons include: * There is a typo in the target name. * A find_package call is missing for an IMPORTED target. * An ALIAS target is missing. CMake Error at benchmark/CMakeLists.txt:5 (target_link_libraries): Target "bench-mpc-walk" links to: example-robot-data::example-robot-data but the target was not found. Possible reasons include: * There is a typo in the target name. * A find_package call is missing for an IMPORTED target. * An ALIAS target is missing. CMake Generate step failed. Build files cannot be regenerated correctly. An unexpected error occured. The last 10 log lines are shown below. | but the target was not found. Possible reasons include: | | * There is a typo in the target name. | * A find_package call is missing for an IMPORTED target. | * An ALIAS target is missing. | | | | -- Generating done (0.1s) | CMake Generate step failed. Build files cannot be regenerated correctly. For details or bug reports, check the complete log file in: /local/robotpkg/var/tmp/robotpkg/wip/py-sobec/work/configure.log make[3]: *** [/local/robotpkg/var/lib/robotpkg/mk/configure/cmake-configure.mk:101: do-configure-cmake(/local/robotpkg/var/tmp/robotpkg/wip/py-sobec/work/sobec-1.4.0)] Error 1 make[2]: *** [/local/robotpkg/var/lib/robotpkg/mk/pkg/package.mk:42: pkg-check-installed] Error 2 => Marking py312-sobec-1.4.0r1 as broken ERROR: make: *** [package] Error 2 ===> Deinstalling for py312-sobec Removed digest-20080510 Removing dependency py312-eigenpy-3.13.0 Removing dependency example-robot-data-5.0.0 Removing dependency proxsuite-0.7.3r1 Removing dependency casadi-3.7.2r1 Removing dependency py312-casadi-3.7.2r1 Removing dependency coal-3.0.4 Removing dependency py312-coal-3.0.4 Removing dependency pinocchio-4.1.0 Removing dependency py312-pinocchio-4.1.0 Removing dependency py312-example-robot-data-5.0.0 Removing dependency crocoddyl-3.2.1r1 Removing dependency py312-crocoddyl-3.2.1r1 Removing dependency ndcurves-2.3.0 Removing dependency py312-ndcurves-2.3.0 Removed jrl-cmakemodules-2.1.0 Removed py312-bullet3-3.24r1 Removed tnftp-20151004~ssl