robotpkg/wip/wamctrl-genom3 bulk build results

wamctrl-genom3-2.4~codels+openprs+pocolibs-client-c+pocolibs-server (category motion or summary)

Platform Status Date Time Log files
Start Total autoconfbrokenbuildbulkcbbhcbbhbyconfigureextractinstallplist
Debian-11-x86_64Broken2026/09/3020:46:5500:03:01View
make: *** [package] Error 2
ViewViewViewView
Debian-12-x86_64Broken2026/09/3021:41:2900:00:51View
make: *** [package] Error 2
ViewViewView
Debian-13-x86_64Broken2026/09/3021:44:2800:00:47View
make: *** [package] Error 2
ViewViewView
Fedora-42-x86_64Broken2026/09/3021:41:3700:00:53View
make: *** [package] Error 2
ViewViewView
Fedora-44-x86_64Broken2026/09/3021:08:0900:01:11View
make: *** [package] Error 2
ViewViewView
NetBSD-11-x86_64Broken2026/09/3021:45:5800:00:48
/usr/pkg/bin/gmake: *** [package] Error 2
ViewViewView
Rocky-10-x86_64Broken2026/09/3021:04:2300:00:54View
make: *** [package] Error 2
ViewViewView
Rocky-8-x86_64N/A2026/09/3021:34:5800:00:04ViewView
pinocchio>=2.3
Ubuntu-20.04-x86_64Warnings2026/09/2218:10:3800:02:02ViewViewViewViewViewView
Ubuntu-22.04-x86_64Broken2026/09/3021:50:4200:00:50View
make: *** [package] Error 2
ViewViewView
Ubuntu-24.04-x86_64Broken2026/09/3021:11:2000:01:14View
make: *** [package] Error 2
ViewViewView
Ubuntu-26.04-x86_64Broken2026/09/3021:00:4500:02:00View
make: *** [package] Error 2
ViewViewView

wamctrl-genom3-2.4~codels+openprs+ros-client-c+ros-client-ros+ros-server (category motion or summary)

Platform Status Date Time Log files
Start Total autoconfbrokenbuildbulkcbbhcbbhbyconfigureextractinstallplist
Debian-11-x86_64Broken2026/09/3020:49:5600:03:11View
make: *** [package] Error 2
ViewViewViewView
Debian-12-x86_64Broken2026/09/3021:42:2000:00:55View
make: *** [package] Error 2
ViewViewView
Debian-13-x86_64Broken2026/09/3021:45:1500:00:51View
make: *** [package] Error 2
ViewViewView
Fedora-42-x86_64Broken2026/09/3021:42:3000:00:54View
make: *** [package] Error 2
ViewViewView
Fedora-44-x86_64Broken2026/09/3021:09:2100:01:00View
make: *** [package] Error 2
ViewViewView
NetBSD-11-x86_64Broken2026/09/3021:46:4600:01:01
/usr/pkg/bin/gmake: *** [package] Error 2
ViewViewView
Rocky-10-x86_64N/A2026/09/3021:05:1700:00:06ViewView
poco>=1
Rocky-8-x86_64N/A2026/09/3021:35:0300:00:07ViewView
pinocchio>=2.3
poco>=1
Ubuntu-20.04-x86_64Warnings2026/09/2218:12:4100:04:15ViewViewViewViewViewView
Ubuntu-22.04-x86_64Broken2026/09/3021:51:3200:01:15View
make: *** [package] Error 2
ViewViewView
Ubuntu-24.04-x86_64Broken2026/09/3021:12:3400:00:59View
make: *** [package] Error 2
ViewViewView
Ubuntu-26.04-x86_64Broken2026/09/3021:02:4600:00:53View
make: *** [package] Error 2
ViewViewView