robotpkg/wip/wamctrl-genom3 bulk build results

Log for wamctrl-genom3-2.4~codels+openprs+pocolibs-client-c+pocolibs-server on Fedora-44-x86_64: autoconf.log (Back)

This file contains any messages produced by compilers while running configure, to aid debugging if configure makes a mistake. It was created by wamctrl-genom3 configure 2.4, which was generated by GNU Autoconf 2.72. Invocation command line was $ ./configure --prefix=/opt/openrobots --infodir=/opt/openrobots/info --mandir=/opt/openrobots/man MAKE=make ## --------- ## ## Platform. ## ## --------- ## hostname = hydra64-fedora44 uname -m = x86_64 uname -r = 7.2.7-200.fc44.x86_64 uname -s = Linux uname -v = #1 SMP PREEMPT_DYNAMIC Mon Sep 21 18:25:57 UTC 2026 /usr/bin/uname -p = unknown /bin/uname -X = unknown /bin/arch = x86_64 /usr/bin/arch -k = unknown /usr/convex/getsysinfo = unknown /usr/bin/hostinfo = unknown /bin/machine = unknown /usr/bin/oslevel = unknown /bin/universe = unknown PATH: /opt/openrobots/bin/ PATH: /opt/openrobots/sbin/ PATH: /usr/local/bin/ PATH: /usr/bin/ ## ----------- ## ## Core tests. ## ## ----------- ## configure:2770: looking for aux files: compile config.guess config.sub ltmain.sh missing install-sh configure:2783: trying ./autoconf/ configure:2812: ./autoconf/compile found configure:2812: ./autoconf/config.guess found configure:2812: ./autoconf/config.sub found configure:2812: ./autoconf/ltmain.sh found configure:2812: ./autoconf/missing found configure:2794: ./autoconf/install-sh found configure:2946: checking for a BSD-compatible install configure:3020: result: /usr/bin/install -c configure:3031: checking whether sleep supports fractional seconds configure:3047: result: yes configure:3050: checking filesystem timestamp resolution configure:3185: result: 0.01 configure:3190: checking whether build environment is sane configure:3235: result: yes configure:3406: checking for a race-free mkdir -p configure:3449: result: /usr/bin/mkdir -p configure:3456: checking for gawk configure:3477: found /usr/bin/gawk configure:3489: result: gawk configure:3500: checking whether make sets $(MAKE) configure:3524: result: yes configure:3550: checking whether make supports nested variables configure:3569: result: yes configure:3583: checking xargs -n works configure:3599: result: yes configure:3679: checking whether UID '500' is supported by ustar format configure:3685: result: yes configure:3692: checking whether GID '355' is supported by ustar format configure:3698: result: yes configure:3706: checking how to create a ustar tar archive configure:3717: tar --version tar (GNU tar) 1.35 Copyright (C) 2023 Free Software Foundation, Inc. License GPLv3+: GNU GPL version 3 or later <https://gnu.org/licenses/gpl.html>. This is free software: you are free to change and redistribute it. There is NO WARRANTY, to the extent permitted by law. Written by John Gilmore and Jay Fenlason. configure:3720: $? = 0 configure:3760: tardir=conftest.dir && eval tar --format=ustar -chf - "$tardir" >conftest.tar configure:3763: $? = 0 configure:3767: tar -xf - <conftest.tar configure:3770: $? = 0 configure:3772: cat conftest.dir/file GrepMe configure:3775: $? = 0 configure:3790: result: gnutar configure:3849: checking build system type configure:3865: result: x86_64-pc-linux-gnu configure:3885: checking host system type configure:3900: result: x86_64-pc-linux-gnu configure:3941: checking how to print strings configure:3968: result: printf configure:4002: checking whether make supports the include directive configure:4017: make -f confmf.GNU && cat confinc.out make[4]: Entering directory '/local/robotpkg/var/tmp/robotpkg/wip/wamctrl-genom3/work/WAMCtrl-genom3-2.4' make[4]: Leaving directory '/local/robotpkg/var/tmp/robotpkg/wip/wamctrl-genom3/work/WAMCtrl-genom3-2.4' this is the am__doit target configure:4020: $? = 0 configure:4039: result: yes (GNU style) configure:4116: checking for gcc configure:4149: result: /usr/bin/gcc configure:4508: checking for C compiler version configure:4517: /usr/bin/gcc --version >&5 gcc (GCC) 16.2.1 20260819 (Red Hat 16.2.1-2) Copyright (C) 2026 Free Software Foundation, Inc. This is free software; see the source for copying conditions. There is NO warranty; not even for MERCHANTABILITY or FITNESS FOR A PARTICULAR PURPOSE. configure:4528: $? = 0 configure:4517: /usr/bin/gcc -v >&5 Using built-in specs. COLLECT_GCC=/usr/bin/gcc COLLECT_LTO_WRAPPER=/usr/libexec/gcc/x86_64-redhat-linux/16/lto-wrapper OFFLOAD_TARGET_NAMES=nvptx-none:amdgcn-amdhsa OFFLOAD_TARGET_DEFAULT=1 Target: x86_64-redhat-linux Configured with: ../configure --enable-bootstrap --enable-languages=c,c++,fortran,objc,obj-c++,ada,go,d,m2,cobol,algol68,lto --prefix=/usr --mandir=/usr/share/man --infodir=/usr/share/info --with-bugurl=https://bugzilla.redhat.com/ --enable-shared --enable-threads=posix --enable-checking=release --enable-multilib --with-system-zlib --enable-__cxa_atexit --disable-libunwind-exceptions --enable-gnu-unique-object --enable-linker-build-id --with-gcc-major-version-only --enable-libstdcxx-backtrace --with-libstdcxx-zoneinfo=/usr/share/zoneinfo --with-linker-hash-style=gnu --enable-plugin --enable-initfini-array --with-isl=/builddir/build/BUILD/gcc-16.2.1-build/gcc-16.2.1-20260819/obj-x86_64-redhat-linux/isl-install --enable-offload-targets=nvptx-none,amdgcn-amdhsa --enable-offload-defaulted --without-cuda-driver --enable-gnu-indirect-function --enable-cet --with-tune=generic --with-tls=gnu2 --with-arch_32=i686 --build=x86_64-redhat-linux --with-build-config=bootstrap-lto --enable-link-serialization=1 --disable-libssp Thread model: posix Supported LTO compression algorithms: zlib zstd gcc version 16.2.1 20260819 (Red Hat 16.2.1-2) (GCC) ... rest of stderr output deleted ... configure:4528: $? = 0 configure:4517: /usr/bin/gcc -V >&5 gcc: error: unrecognized command-line option '-V' gcc: fatal error: no input files compilation terminated. configure:4528: $? = 1 configure:4517: /usr/bin/gcc -qversion >&5 gcc: error: unrecognized command-line option '-qversion'; did you mean '--version'? gcc: fatal error: no input files compilation terminated. configure:4528: $? = 1 configure:4517: /usr/bin/gcc -version >&5 gcc: error: unrecognized command-line option '-version' gcc: fatal error: no input files compilation terminated. configure:4528: $? = 1 configure:4548: checking whether the C compiler works configure:4570: /usr/bin/gcc -pipe -O3 -DNDEBUG -DCOAL_DISABLE_HPP_FCL_WARNINGS conftest.c >&5 configure:4574: $? = 0 configure:4625: result: yes configure:4629: checking for C compiler default output file name configure:4631: result: a.out configure:4637: checking for suffix of executables configure:4644: /usr/bin/gcc -o conftest -pipe -O3 -DNDEBUG -DCOAL_DISABLE_HPP_FCL_WARNINGS conftest.c >&5 configure:4648: $? = 0 configure:4672: result: configure:4696: checking whether we are cross compiling configure:4704: /usr/bin/gcc -o conftest -pipe -O3 -DNDEBUG -DCOAL_DISABLE_HPP_FCL_WARNINGS conftest.c >&5 configure:4708: $? = 0 configure:4715: ./conftest configure:4719: $? = 0 configure:4734: result: no configure:4740: checking for suffix of object files configure:4763: /usr/bin/gcc -c -pipe -O3 -DNDEBUG -DCOAL_DISABLE_HPP_FCL_WARNINGS conftest.c >&5 configure:4767: $? = 0 configure:4791: result: o configure:4795: checking whether the compiler supports GNU C configure:4815: /usr/bin/gcc -c -pipe -O3 -DNDEBUG -DCOAL_DISABLE_HPP_FCL_WARNINGS conftest.c >&5 configure:4815: $? = 0 configure:4827: result: yes configure:4838: checking whether /usr/bin/gcc accepts -g configure:4859: /usr/bin/gcc -c -g -DCOAL_DISABLE_HPP_FCL_WARNINGS conftest.c >&5 configure:4859: $? = 0 configure:4906: result: yes configure:4926: checking for /usr/bin/gcc option to enable C11 features configure:4941: /usr/bin/gcc -c -pipe -O3 -DNDEBUG -DCOAL_DISABLE_HPP_FCL_WARNINGS conftest.c >&5 configure:4941: $? = 0 configure:4960: result: none needed configure:5084: checking whether /usr/bin/gcc understands -c and -o together configure:5107: /usr/bin/gcc -c conftest.c -o conftest2.o configure:5110: $? = 0 configure:5107: /usr/bin/gcc -c conftest.c -o conftest2.o configure:5110: $? = 0 configure:5126: result: yes configure:5145: checking dependency style of /usr/bin/gcc configure:5258: result: gcc3 configure:5273: checking for a sed that does not truncate output configure:5345: result: /usr/bin/sed configure:5363: checking for grep that handles long lines and -e configure:5429: result: /usr/bin/grep configure:5434: checking for egrep configure:5504: result: /usr/bin/grep -E configure:5511: checking for fgrep configure:5581: result: /usr/bin/grep -F configure:5618: checking for ld used by /usr/bin/gcc configure:5687: result: /usr/bin/ld configure:5694: checking if the linker (/usr/bin/ld) is GNU ld configure:5711: result: yes configure:5723: checking for BSD- or MS-compatible name lister (nm) configure:5779: result: /usr/bin/nm -B configure:5921: checking the name lister (/usr/bin/nm -B) interface configure:5929: /usr/bin/gcc -c -pipe -O3 -DNDEBUG -DCOAL_DISABLE_HPP_FCL_WARNINGS conftest.c >&5 configure:5932: /usr/bin/nm -B "conftest.o" configure:5935: output 0000000000000000 B some_variable configure:5943: result: BSD nm configure:5946: checking whether ln -s works configure:5950: result: yes configure:5958: checking the maximum length of command line arguments configure:6091: result: 1572864 configure:6139: checking how to convert x86_64-pc-linux-gnu file names to x86_64-pc-linux-gnu format configure:6181: result: func_convert_file_noop configure:6188: checking how to convert x86_64-pc-linux-gnu file names to toolchain format configure:6210: result: func_convert_file_noop configure:6217: checking for /usr/bin/ld option to reload object files configure:6226: result: -r configure:6259: checking for file configure:6280: found /usr/bin/file configure:6293: result: file configure:6356: checking for objdump configure:6377: found /usr/bin/objdump configure:6389: result: objdump configure:6421: checking how to recognize dependent libraries configure:6630: result: pass_all configure:6721: checking for dlltool configure:6757: result: no configure:6787: checking how to associate runtime and link libraries configure:6816: result: printf %s\n configure:6877: checking for ranlib configure:6898: found /usr/bin/ranlib configure:6910: result: ranlib configure:6987: checking for ar configure:7008: found /usr/bin/ar configure:7020: result: ar configure:7073: checking for archiver @FILE support configure:7091: /usr/bin/gcc -c -pipe -O3 -DNDEBUG -DCOAL_DISABLE_HPP_FCL_WARNINGS conftest.c >&5 configure:7091: $? = 0 configure:7095: ar cr libconftest.a @conftest.lst >&5 configure:7098: $? = 0 configure:7103: ar cr libconftest.a @conftest.lst >&5 ar: conftest.o: No such file or directory configure:7106: $? = 1 configure:7119: result: @ configure:7183: checking for strip configure:7204: found /usr/bin/strip configure:7216: result: strip configure:7319: checking command to parse /usr/bin/nm -B output from /usr/bin/gcc object configure:7473: /usr/bin/gcc -c -pipe -O3 -DNDEBUG -DCOAL_DISABLE_HPP_FCL_WARNINGS conftest.c >&5 configure:7476: $? = 0 configure:7480: /usr/bin/nm -B conftest.o | /usr/bin/sed -n -e 's/^.*[ ]\([ABCDGIRSTW][ABCDGIRSTW]*\)[ ][ ]*\([_A-Za-z][_A-Za-z0-9]*\)$/\1 \2 \2/p' | /usr/bin/sed '/ __gnu_lto/d' > conftest.nm configure:7546: /usr/bin/gcc -o conftest -pipe -O3 -DNDEBUG -DCOAL_DISABLE_HPP_FCL_WARNINGS conftest.c conftstm.o >&5 configure:7549: $? = 0 configure:7588: result: ok configure:7635: checking for sysroot configure:7669: result: no configure:7676: checking for a working dd configure:7721: result: /usr/bin/dd configure:7725: checking how to truncate binary pipes configure:7742: result: /usr/bin/dd bs=4096 count=1 configure:7879: /usr/bin/gcc -c -pipe -O3 -DNDEBUG -DCOAL_DISABLE_HPP_FCL_WARNINGS conftest.c >&5 configure:7882: $? = 0 configure:8082: checking for mt configure:8118: result: no configure:8138: checking if : is a manifest tool configure:8145: : '-?' configure:8154: result: no configure:8951: checking for stdio.h configure:8951: /usr/bin/gcc -c -pipe -O3 -DNDEBUG -DCOAL_DISABLE_HPP_FCL_WARNINGS conftest.c >&5 configure:8951: $? = 0 configure:8951: result: yes configure:8951: checking for stdlib.h configure:8951: /usr/bin/gcc -c -pipe -O3 -DNDEBUG -DCOAL_DISABLE_HPP_FCL_WARNINGS conftest.c >&5 configure:8951: $? = 0 configure:8951: result: yes configure:8951: checking for string.h configure:8951: /usr/bin/gcc -c -pipe -O3 -DNDEBUG -DCOAL_DISABLE_HPP_FCL_WARNINGS conftest.c >&5 configure:8951: $? = 0 configure:8951: result: yes configure:8951: checking for inttypes.h configure:8951: /usr/bin/gcc -c -pipe -O3 -DNDEBUG -DCOAL_DISABLE_HPP_FCL_WARNINGS conftest.c >&5 configure:8951: $? = 0 configure:8951: result: yes configure:8951: checking for stdint.h configure:8951: /usr/bin/gcc -c -pipe -O3 -DNDEBUG -DCOAL_DISABLE_HPP_FCL_WARNINGS conftest.c >&5 configure:8951: $? = 0 configure:8951: result: yes configure:8951: checking for strings.h configure:8951: /usr/bin/gcc -c -pipe -O3 -DNDEBUG -DCOAL_DISABLE_HPP_FCL_WARNINGS conftest.c >&5 configure:8951: $? = 0 configure:8951: result: yes configure:8951: checking for sys/stat.h configure:8951: /usr/bin/gcc -c -pipe -O3 -DNDEBUG -DCOAL_DISABLE_HPP_FCL_WARNINGS conftest.c >&5 configure:8951: $? = 0 configure:8951: result: yes configure:8951: checking for sys/types.h configure:8951: /usr/bin/gcc -c -pipe -O3 -DNDEBUG -DCOAL_DISABLE_HPP_FCL_WARNINGS conftest.c >&5 configure:8951: $? = 0 configure:8951: result: yes configure:8951: checking for unistd.h configure:8951: /usr/bin/gcc -c -pipe -O3 -DNDEBUG -DCOAL_DISABLE_HPP_FCL_WARNINGS conftest.c >&5 configure:8951: $? = 0 configure:8951: result: yes configure:8976: checking for dlfcn.h configure:8976: /usr/bin/gcc -c -pipe -O3 -DNDEBUG -DCOAL_DISABLE_HPP_FCL_WARNINGS conftest.c >&5 configure:8976: $? = 0 configure:8976: result: yes configure:9278: checking for objdir configure:9295: result: .libs configure:9561: checking if /usr/bin/gcc supports -fno-rtti -fno-exceptions configure:9580: /usr/bin/gcc -c -pipe -O3 -DNDEBUG -DCOAL_DISABLE_HPP_FCL_WARNINGS -fno-rtti -fno-exceptions conftest.c >&5 cc1: warning: command-line option '-fno-rtti' is valid for C++/D/ObjC++ but not for C configure:9584: $? = 0 configure:9598: result: no configure:9971: checking for /usr/bin/gcc option to produce PIC configure:9980: result: -fPIC -DPIC configure:9988: checking if /usr/bin/gcc PIC flag -fPIC -DPIC works configure:10007: /usr/bin/gcc -c -pipe -O3 -DNDEBUG -DCOAL_DISABLE_HPP_FCL_WARNINGS -fPIC -DPIC -DPIC conftest.c >&5 configure:10011: $? = 0 configure:10025: result: yes configure:10054: checking if /usr/bin/gcc static flag -static works configure:10084: result: no configure:10099: checking if /usr/bin/gcc supports -c -o file.o configure:10121: /usr/bin/gcc -c -pipe -O3 -DNDEBUG -DCOAL_DISABLE_HPP_FCL_WARNINGS -o out/conftest2.o conftest.c >&5 configure:10125: $? = 0 configure:10148: result: yes configure:10156: checking if /usr/bin/gcc supports -c -o file.o configure:10205: result: yes configure:10238: checking whether the /usr/bin/gcc linker (/usr/bin/ld -m elf_x86_64) supports shared libraries configure:11522: result: yes configure:11559: checking whether -lc should be explicitly linked in configure:11568: /usr/bin/gcc -c -pipe -O3 -DNDEBUG -DCOAL_DISABLE_HPP_FCL_WARNINGS conftest.c >&5 configure:11571: $? = 0 configure:11586: /usr/bin/gcc -shared -fPIC -DPIC conftest.o -v -Wl,-soname -Wl,conftest -o conftest 2\>\&1 \| /usr/bin/grep -lc \>/dev/null 2\>\&1 configure:11589: $? = 0 configure:11604: result: no configure:11764: checking dynamic linker characteristics configure:12383: /usr/bin/gcc -o conftest -pipe -O3 -DNDEBUG -DCOAL_DISABLE_HPP_FCL_WARNINGS -Wl,-rpath -Wl,/foo conftest.c >&5 configure:12383: $? = 0 configure:13151: result: GNU/Linux ld.so configure:13273: checking how to hardcode library paths into programs configure:13298: result: immediate configure:13898: checking whether stripping libraries is possible configure:13907: result: yes configure:13949: checking if libtool supports shared libraries configure:13951: result: yes configure:13954: checking whether to build shared libraries configure:13979: result: yes configure:13982: checking whether to build static libraries configure:13986: result: no configure:14077: checking for gcc configure:14110: result: /usr/bin/gcc configure:14469: checking for C compiler version configure:14478: /usr/bin/gcc --version >&5 gcc (GCC) 16.2.1 20260819 (Red Hat 16.2.1-2) Copyright (C) 2026 Free Software Foundation, Inc. This is free software; see the source for copying conditions. There is NO warranty; not even for MERCHANTABILITY or FITNESS FOR A PARTICULAR PURPOSE. configure:14489: $? = 0 configure:14478: /usr/bin/gcc -v >&5 Using built-in specs. COLLECT_GCC=/usr/bin/gcc COLLECT_LTO_WRAPPER=/usr/libexec/gcc/x86_64-redhat-linux/16/lto-wrapper OFFLOAD_TARGET_NAMES=nvptx-none:amdgcn-amdhsa OFFLOAD_TARGET_DEFAULT=1 Target: x86_64-redhat-linux Configured with: ../configure --enable-bootstrap --enable-languages=c,c++,fortran,objc,obj-c++,ada,go,d,m2,cobol,algol68,lto --prefix=/usr --mandir=/usr/share/man --infodir=/usr/share/info --with-bugurl=https://bugzilla.redhat.com/ --enable-shared --enable-threads=posix --enable-checking=release --enable-multilib --with-system-zlib --enable-__cxa_atexit --disable-libunwind-exceptions --enable-gnu-unique-object --enable-linker-build-id --with-gcc-major-version-only --enable-libstdcxx-backtrace --with-libstdcxx-zoneinfo=/usr/share/zoneinfo --with-linker-hash-style=gnu --enable-plugin --enable-initfini-array --with-isl=/builddir/build/BUILD/gcc-16.2.1-build/gcc-16.2.1-20260819/obj-x86_64-redhat-linux/isl-install --enable-offload-targets=nvptx-none,amdgcn-amdhsa --enable-offload-defaulted --without-cuda-driver --enable-gnu-indirect-function --enable-cet --with-tune=generic --with-tls=gnu2 --with-arch_32=i686 --build=x86_64-redhat-linux --with-build-config=bootstrap-lto --enable-link-serialization=1 --disable-libssp Thread model: posix Supported LTO compression algorithms: zlib zstd gcc version 16.2.1 20260819 (Red Hat 16.2.1-2) (GCC) ... rest of stderr output deleted ... configure:14489: $? = 0 configure:14478: /usr/bin/gcc -V >&5 gcc: error: unrecognized command-line option '-V' gcc: fatal error: no input files compilation terminated. configure:14489: $? = 1 configure:14478: /usr/bin/gcc -qversion >&5 gcc: error: unrecognized command-line option '-qversion'; did you mean '--version'? gcc: fatal error: no input files compilation terminated. configure:14489: $? = 1 configure:14478: /usr/bin/gcc -version >&5 gcc: error: unrecognized command-line option '-version' gcc: fatal error: no input files compilation terminated. configure:14489: $? = 1 configure:14493: checking whether the compiler supports GNU C configure:14525: result: yes configure:14536: checking whether /usr/bin/gcc accepts -g configure:14604: result: yes configure:14624: checking for /usr/bin/gcc option to enable C11 features configure:14658: result: none needed configure:14782: checking whether /usr/bin/gcc understands -c and -o together configure:14824: result: yes configure:14843: checking dependency style of /usr/bin/gcc configure:14956: result: gcc3 configure:15101: checking for C++ compiler version configure:15110: /usr/bin/g++ --version >&5 g++ (GCC) 16.2.1 20260819 (Red Hat 16.2.1-2) Copyright (C) 2026 Free Software Foundation, Inc. This is free software; see the source for copying conditions. There is NO warranty; not even for MERCHANTABILITY or FITNESS FOR A PARTICULAR PURPOSE. configure:15121: $? = 0 configure:15110: /usr/bin/g++ -v >&5 Using built-in specs. COLLECT_GCC=/usr/bin/g++ COLLECT_LTO_WRAPPER=/usr/libexec/gcc/x86_64-redhat-linux/16/lto-wrapper OFFLOAD_TARGET_NAMES=nvptx-none:amdgcn-amdhsa OFFLOAD_TARGET_DEFAULT=1 Target: x86_64-redhat-linux Configured with: ../configure --enable-bootstrap --enable-languages=c,c++,fortran,objc,obj-c++,ada,go,d,m2,cobol,algol68,lto --prefix=/usr --mandir=/usr/share/man --infodir=/usr/share/info --with-bugurl=https://bugzilla.redhat.com/ --enable-shared --enable-threads=posix --enable-checking=release --enable-multilib --with-system-zlib --enable-__cxa_atexit --disable-libunwind-exceptions --enable-gnu-unique-object --enable-linker-build-id --with-gcc-major-version-only --enable-libstdcxx-backtrace --with-libstdcxx-zoneinfo=/usr/share/zoneinfo --with-linker-hash-style=gnu --enable-plugin --enable-initfini-array --with-isl=/builddir/build/BUILD/gcc-16.2.1-build/gcc-16.2.1-20260819/obj-x86_64-redhat-linux/isl-install --enable-offload-targets=nvptx-none,amdgcn-amdhsa --enable-offload-defaulted --without-cuda-driver --enable-gnu-indirect-function --enable-cet --with-tune=generic --with-tls=gnu2 --with-arch_32=i686 --build=x86_64-redhat-linux --with-build-config=bootstrap-lto --enable-link-serialization=1 --disable-libssp Thread model: posix Supported LTO compression algorithms: zlib zstd gcc version 16.2.1 20260819 (Red Hat 16.2.1-2) (GCC) ... rest of stderr output deleted ... configure:15121: $? = 0 configure:15110: /usr/bin/g++ -V >&5 g++: error: unrecognized command-line option '-V' g++: fatal error: no input files compilation terminated. configure:15121: $? = 1 configure:15110: /usr/bin/g++ -qversion >&5 g++: error: unrecognized command-line option '-qversion'; did you mean '--version'? g++: fatal error: no input files compilation terminated. configure:15121: $? = 1 configure:15125: checking whether the compiler supports GNU C++ configure:15145: /usr/bin/g++ -c -pipe -O3 -DNDEBUG -DCOAL_DISABLE_HPP_FCL_WARNINGS conftest.cpp >&5 configure:15145: $? = 0 configure:15157: result: yes configure:15168: checking whether /usr/bin/g++ accepts -g configure:15189: /usr/bin/g++ -c -g -DCOAL_DISABLE_HPP_FCL_WARNINGS conftest.cpp >&5 configure:15189: $? = 0 configure:15236: result: yes configure:15256: checking for /usr/bin/g++ option to enable C++11 features configure:15271: /usr/bin/g++ -c -pipe -O3 -DNDEBUG -DCOAL_DISABLE_HPP_FCL_WARNINGS conftest.cpp >&5 conftest.cpp: In function 'int main(int, char**)': conftest.cpp:187:25: warning: empty parentheses were disambiguated as a function declaration [-Wvexing-parse] 187 | cxx11test::delegate d2(); | ^~ conftest.cpp:187:25: note: remove parentheses to default-initialize a variable 187 | cxx11test::delegate d2(); | ^~ | -- conftest.cpp:187:25: note: or replace parentheses with braces to value-initialize a variable configure:15271: $? = 0 configure:15290: result: none needed configure:15361: checking dependency style of /usr/bin/g++ configure:15474: result: gcc3 configure:15507: checking how to run the C++ preprocessor configure:15574: result: /usr/bin/g++ -E configure:15588: /usr/bin/g++ -E -DCOAL_DISABLE_HPP_FCL_WARNINGS conftest.cpp configure:15588: $? = 0 configure:15604: /usr/bin/g++ -E -DCOAL_DISABLE_HPP_FCL_WARNINGS conftest.cpp conftest.cpp:21:10: fatal error: ac_nonexistent.h: No such file or directory 21 | #include <ac_nonexistent.h> | ^~~~~~~~~~~~~~~~~~ compilation terminated. configure:15604: $? = 1 configure: failed program was: | /* confdefs.h */ | #define PACKAGE_NAME "wamctrl-genom3" | #define PACKAGE_TARNAME "wamctrl-genom3" | #define PACKAGE_VERSION "2.4" | #define PACKAGE_STRING "wamctrl-genom3 2.4" | #define PACKAGE_BUGREPORT "openrobots@laas.fr" | #define PACKAGE_URL "" | #define HAVE_STDIO_H 1 | #define HAVE_STDLIB_H 1 | #define HAVE_STRING_H 1 | #define HAVE_INTTYPES_H 1 | #define HAVE_STDINT_H 1 | #define HAVE_STRINGS_H 1 | #define HAVE_SYS_STAT_H 1 | #define HAVE_SYS_TYPES_H 1 | #define HAVE_UNISTD_H 1 | #define STDC_HEADERS 1 | #define HAVE_DLFCN_H 1 | #define LT_OBJDIR ".libs/" | /* end confdefs.h. */ | #include <ac_nonexistent.h> configure:15772: checking for ld used by /usr/bin/g++ configure:15841: result: /usr/bin/ld -m elf_x86_64 configure:15848: checking if the linker (/usr/bin/ld -m elf_x86_64) is GNU ld configure:15865: result: yes configure:15919: checking whether the /usr/bin/g++ linker (/usr/bin/ld -m elf_x86_64) supports shared libraries configure:17007: result: yes configure:17043: /usr/bin/g++ -c -pipe -O3 -DNDEBUG -DCOAL_DISABLE_HPP_FCL_WARNINGS conftest.cpp >&5 configure:17046: $? = 0 configure:17532: checking for /usr/bin/g++ option to produce PIC configure:17541: result: -fPIC -DPIC configure:17549: checking if /usr/bin/g++ PIC flag -fPIC -DPIC works configure:17568: /usr/bin/g++ -c -pipe -O3 -DNDEBUG -DCOAL_DISABLE_HPP_FCL_WARNINGS -fPIC -DPIC -DPIC conftest.cpp >&5 configure:17572: $? = 0 configure:17586: result: yes configure:17609: checking if /usr/bin/g++ static flag -static works configure:17639: result: no configure:17651: checking if /usr/bin/g++ supports -c -o file.o configure:17673: /usr/bin/g++ -c -pipe -O3 -DNDEBUG -DCOAL_DISABLE_HPP_FCL_WARNINGS -o out/conftest2.o conftest.cpp >&5 configure:17677: $? = 0 configure:17700: result: yes configure:17705: checking if /usr/bin/g++ supports -c -o file.o configure:17754: result: yes configure:17784: checking whether the /usr/bin/g++ linker (/usr/bin/ld -m elf_x86_64) supports shared libraries configure:17824: result: yes configure:17967: checking dynamic linker characteristics configure:19264: result: GNU/Linux ld.so configure:19329: checking how to hardcode library paths into programs configure:19354: result: immediate configure:19396: checking for GNU make configure:19436: result: make configure:19568: checking pkg-config is at least version 0.9.0 configure:19571: result: yes configure:19584: checking for openrobots2-idl >= 2.0, genom3 >= 2.99.41 configure:19591: $PKG_CONFIG --exists --print-errors "$requires_SPEC" configure:19594: $? = 0 configure:19608: $PKG_CONFIG --exists --print-errors "$requires_SPEC" configure:19611: $? = 0 configure:19669: result: yes configure:19675: checking for eigen3, proxsuite >= 0.6.4, pinocchio, urdfdom configure:19682: $PKG_CONFIG --exists --print-errors "$codels_requires_SPEC" Package pinocchio was not found in the pkg-config search path. Perhaps you should add the directory containing `pinocchio.pc' to the PKG_CONFIG_PATH environment variable Package 'pinocchio' not found configure:19685: $? = 1 configure:19699: $PKG_CONFIG --exists --print-errors "$codels_requires_SPEC" Package pinocchio was not found in the pkg-config search path. Perhaps you should add the directory containing `pinocchio.pc' to the PKG_CONFIG_PATH environment variable Package 'pinocchio' not found configure:19702: $? = 1 configure:19716: result: no Package 'pinocchio' not found configure:19732: error: Package requirements (eigen3, proxsuite >= 0.6.4, pinocchio, urdfdom) were not met: Package 'pinocchio' not found Consider adjusting the PKG_CONFIG_PATH environment variable if you installed software in a non-standard prefix. Alternatively, you may set the environment variables codels_requires_CFLAGS and codels_requires_LIBS to avoid the need to call pkg-config. See the pkg-config man page for more details. ## ---------------- ## ## Cache variables. ## ## ---------------- ## ac_cv_build=x86_64-pc-linux-gnu ac_cv_c_compiler_gnu=yes ac_cv_cxx_compiler_gnu=yes ac_cv_env_CCC_set= ac_cv_env_CCC_value= ac_cv_env_CC_set=set ac_cv_env_CC_value=/usr/bin/gcc ac_cv_env_CFLAGS_set=set ac_cv_env_CFLAGS_value='-pipe -O3 -DNDEBUG' ac_cv_env_CPPFLAGS_set=set ac_cv_env_CPPFLAGS_value=-DCOAL_DISABLE_HPP_FCL_WARNINGS ac_cv_env_CXXCPP_set=set ac_cv_env_CXXCPP_value='/usr/bin/g++ -E' ac_cv_env_CXXFLAGS_set=set ac_cv_env_CXXFLAGS_value='-pipe -O3 -DNDEBUG' ac_cv_env_CXX_set=set ac_cv_env_CXX_value=/usr/bin/g++ ac_cv_env_LDFLAGS_set=set ac_cv_env_LDFLAGS_value= ac_cv_env_LIBS_set=set ac_cv_env_LIBS_value= ac_cv_env_LT_SYS_LIBRARY_PATH_set= ac_cv_env_LT_SYS_LIBRARY_PATH_value= ac_cv_env_PKG_CONFIG_LIBDIR_set=set ac_cv_env_PKG_CONFIG_LIBDIR_value=/usr/lib64/pkgconfig:/usr/share/pkgconfig ac_cv_env_PKG_CONFIG_PATH_set=set ac_cv_env_PKG_CONFIG_PATH_value=/local/robotpkg/var/tmp/robotpkg/wip/wamctrl-genom3/work/WAMCtrl-genom3-2.4:/local/robotpkg/var/tmp/robotpkg/wip/wamctrl-genom3/work/templates/pocolibs/client/c:/local/robotpkg/var/tmp/robotpkg/wip/wamctrl-genom3/work/templates/pocolibs/server:/local/robotpkg/var/tmp/robotpkg/wip/wamctrl-genom3/work/templates/openprs/client:/opt/openrobots/lib/pkgconfig ac_cv_env_PKG_CONFIG_set=set ac_cv_env_PKG_CONFIG_value=/usr/bin/pkg-config ac_cv_env_build_alias_set= ac_cv_env_build_alias_value= ac_cv_env_codels_requires_CFLAGS_set= ac_cv_env_codels_requires_CFLAGS_value= ac_cv_env_codels_requires_LIBS_set= ac_cv_env_codels_requires_LIBS_value= ac_cv_env_host_alias_set= ac_cv_env_host_alias_value= ac_cv_env_requires_CFLAGS_set= ac_cv_env_requires_CFLAGS_value= ac_cv_env_requires_LIBS_set= ac_cv_env_requires_LIBS_value= ac_cv_env_target_alias_set= ac_cv_env_target_alias_value= ac_cv_header_dlfcn_h=yes ac_cv_header_inttypes_h=yes ac_cv_header_stdint_h=yes ac_cv_header_stdio_h=yes ac_cv_header_stdlib_h=yes ac_cv_header_string_h=yes ac_cv_header_strings_h=yes ac_cv_header_sys_stat_h=yes ac_cv_header_sys_types_h=yes ac_cv_header_unistd_h=yes ac_cv_host=x86_64-pc-linux-gnu ac_cv_objext=o ac_cv_path_EGREP='/usr/bin/grep -E' ac_cv_path_EGREP_TRADITIONAL='/usr/bin/grep -E' ac_cv_path_FGREP='/usr/bin/grep -F' ac_cv_path_GREP=/usr/bin/grep ac_cv_path_MAKE=make ac_cv_path_SED=/usr/bin/sed ac_cv_path_install='/usr/bin/install -c' ac_cv_path_lt_DD=/usr/bin/dd ac_cv_path_mkdir=/usr/bin/mkdir ac_cv_prog_AWK=gawk ac_cv_prog_CXXCPP='/usr/bin/g++ -E' ac_cv_prog_FILECMD=file ac_cv_prog_ac_ct_AR=ar ac_cv_prog_ac_ct_CC=/usr/bin/gcc ac_cv_prog_ac_ct_OBJDUMP=objdump ac_cv_prog_ac_ct_RANLIB=ranlib ac_cv_prog_ac_ct_STRIP=strip ac_cv_prog_cc_c11= ac_cv_prog_cc_g=yes ac_cv_prog_cc_stdc= ac_cv_prog_cxx_cxx11= ac_cv_prog_cxx_g=yes ac_cv_prog_cxx_stdcxx= ac_cv_prog_make_make_set=yes am_cv_CC_dependencies_compiler_type=gcc3 am_cv_CXX_dependencies_compiler_type=gcc3 am_cv_filesystem_timestamp_resolution=0.01 am_cv_make_support_nested_variables=yes am_cv_prog_cc_c_o=yes am_cv_prog_tar_ustar=gnutar am_cv_sleep_fractional_seconds=yes am_cv_xargs_n_works=yes lt_cv_ar_at_file=@ lt_cv_archive_cmds_need_lc=no lt_cv_deplibs_check_method=pass_all lt_cv_file_magic_cmd='$MAGIC_CMD' lt_cv_file_magic_test_file= lt_cv_ld_reload_flag=-r lt_cv_nm_interface='BSD nm' lt_cv_objdir=.libs lt_cv_path_LD=/usr/bin/ld lt_cv_path_LDCXX='/usr/bin/ld -m elf_x86_64' lt_cv_path_NM='/usr/bin/nm -B' lt_cv_path_manifest_tool=no lt_cv_prog_compiler_c_o=yes lt_cv_prog_compiler_c_o_CXX=yes lt_cv_prog_compiler_pic='-fPIC -DPIC' lt_cv_prog_compiler_pic_CXX='-fPIC -DPIC' lt_cv_prog_compiler_pic_works=yes lt_cv_prog_compiler_pic_works_CXX=yes lt_cv_prog_compiler_rtti_exceptions=no lt_cv_prog_compiler_static_works=no lt_cv_prog_compiler_static_works_CXX=no lt_cv_prog_gnu_ld=yes lt_cv_prog_gnu_ldcxx=yes lt_cv_sharedlib_from_linklib_cmd='printf %s\n' lt_cv_shlibpath_overrides_runpath=yes lt_cv_sys_global_symbol_pipe='/usr/bin/sed -n -e '\''s/^.*[ ]\([ABCDGIRSTW][ABCDGIRSTW]*\)[ ][ ]*\([_A-Za-z][_A-Za-z0-9]*\)$/\1 \2 \2/p'\'' | /usr/bin/sed '\''/ __gnu_lto/d'\''' lt_cv_sys_global_symbol_to_c_name_address='/usr/bin/sed -n -e '\''s/^: \(.*\) .*$/ {"\1", (void *) 0},/p'\'' -e '\''s/^[ABCDGIRSTW][ABCDGIRSTW]* .* \(.*\)$/ {"\1", (void *) \&\1},/p'\''' lt_cv_sys_global_symbol_to_c_name_address_lib_prefix='/usr/bin/sed -n -e '\''s/^: \(.*\) .*$/ {"\1", (void *) 0},/p'\'' -e '\''s/^[ABCDGIRSTW][ABCDGIRSTW]* .* \(lib.*\)$/ {"\1", (void *) \&\1},/p'\'' -e '\''s/^[ABCDGIRSTW][ABCDGIRSTW]* .* \(.*\)$/ {"lib\1", (void *) \&\1},/p'\''' lt_cv_sys_global_symbol_to_cdecl='/usr/bin/sed -n -e '\''s/^T .* \(.*\)$/extern int \1();/p'\'' -e '\''s/^[ABCDGIRSTW][ABCDGIRSTW]* .* \(.*\)$/extern char \1;/p'\''' lt_cv_sys_global_symbol_to_import= lt_cv_sys_max_cmd_len=1572864 lt_cv_to_host_file_cmd=func_convert_file_noop lt_cv_to_tool_file_cmd=func_convert_file_noop lt_cv_truncate_bin='/usr/bin/dd bs=4096 count=1' pkg_cv_requires_CFLAGS='-I/opt/openrobots/share/idl/openrobots2-idl -I/opt/openrobots/include' pkg_cv_requires_LIBS= ## ----------------- ## ## Output variables. ## ## ----------------- ## ACLOCAL='/usr/bin/aclocal' AG_TEMPLATES_SUBDIRS='' AMDEPBACKSLASH='\' AMDEP_FALSE='#' AMDEP_TRUE='' AMTAR='$${TAR-tar}' AM_BACKSLASH='\' AM_DEFAULT_V='' AM_DEFAULT_VERBOSITY='1' AM_V='' AR='ar' ASCIIDOCTOR='' AUTOCONF='/usr/bin/autoconf' AUTOHEADER='${SHELL} '\''/local/robotpkg/var/tmp/robotpkg/wip/wamctrl-genom3/work/WAMCtrl-genom3-2.4/autoconf/missing'\'' autoheader' AUTOMAKE='/usr/bin/automake' AWK='gawk' CC='/usr/bin/gcc' CCDEPMODE='depmode=gcc3' CFLAGS='-pipe -O3 -DNDEBUG' CPPFLAGS='-DCOAL_DISABLE_HPP_FCL_WARNINGS' CSCOPE='cscope' CTAGS='ctags' CXX='/usr/bin/g++' CXXCPP='/usr/bin/g++ -E' CXXDEPMODE='depmode=gcc3' CXXFLAGS='-pipe -O3 -DNDEBUG' CYGPATH_W='echo' DEFS='' DEPDIR='.deps' DLLTOOL='false' DSYMUTIL='' DUMPBIN='' ECHO_C='' ECHO_N='-n' ECHO_T='' EGREP='/usr/bin/grep -E' ETAGS='etags' EXEEXT='' FGREP='/usr/bin/grep -F' FILECMD='file' GENOM3='/opt/openrobots/bin/genom3' GREP='/usr/bin/grep' INSTALL_DATA='${INSTALL} -m 644' INSTALL_PROGRAM='${INSTALL}' INSTALL_SCRIPT='${INSTALL}' INSTALL_STRIP_PROGRAM='$(install_sh) -c -s' LD='/usr/bin/ld -m elf_x86_64' LDFLAGS='' LIBOBJS='' LIBS='' LIBTOOL='$(SHELL) $(top_builddir)/libtool' LIPO='' LN_S='ln -s' LTLIBOBJS='' LT_SYS_LIBRARY_PATH='' MAKE='make' MAKEINFO='${SHELL} '\''/local/robotpkg/var/tmp/robotpkg/wip/wamctrl-genom3/work/WAMCtrl-genom3-2.4/autoconf/missing'\'' makeinfo' MANIFEST_TOOL=':' MKDIR_P='/usr/bin/mkdir -p' NM='/usr/bin/nm -B' NMEDIT='' OBJDUMP='objdump' OBJEXT='o' OTOOL64='' OTOOL='' PACKAGE='wamctrl-genom3' PACKAGE_BUGREPORT='openrobots@laas.fr' PACKAGE_NAME='wamctrl-genom3' PACKAGE_STRING='wamctrl-genom3 2.4' PACKAGE_TARNAME='wamctrl-genom3' PACKAGE_URL='' PACKAGE_VERSION='2.4' PATH_SEPARATOR=':' PKG_CONFIG='/usr/bin/pkg-config' PKG_CONFIG_LIBDIR='/usr/lib64/pkgconfig:/usr/share/pkgconfig' PKG_CONFIG_PATH='/local/robotpkg/var/tmp/robotpkg/wip/wamctrl-genom3/work/WAMCtrl-genom3-2.4:/local/robotpkg/var/tmp/robotpkg/wip/wamctrl-genom3/work/templates/pocolibs/client/c:/local/robotpkg/var/tmp/robotpkg/wip/wamctrl-genom3/work/templates/pocolibs/server:/local/robotpkg/var/tmp/robotpkg/wip/wamctrl-genom3/work/templates/openprs/client:/opt/openrobots/lib/pkgconfig' RANLIB='ranlib' SED='/usr/bin/sed' SET_MAKE='' SHELL='/bin/sh' STRIP='strip' VERSION='2.4' ac_ct_AR='ar' ac_ct_CC='/usr/bin/gcc' ac_ct_CXX='' ac_ct_DUMPBIN='' ag_autoreconf='' am__EXEEXT_FALSE='' am__EXEEXT_TRUE='' am__fastdepCC_FALSE='#' am__fastdepCC_TRUE='' am__fastdepCXX_FALSE='#' am__fastdepCXX_TRUE='' am__include='include' am__isrc='' am__leading_dot='.' am__nodep='_no' am__quote='' am__rm_f_notfound='' am__tar='tar --format=ustar -chf - "$$tardir"' am__untar='tar -xf -' am__xargs_n='xargs -n' bindir='${exec_prefix}/bin' build='x86_64-pc-linux-gnu' build_alias='' build_cpu='x86_64' build_os='linux-gnu' build_vendor='pc' codels_requires_CFLAGS='' codels_requires_LIBS='' codels_requires_SPEC='eigen3, proxsuite >= 0.6.4, pinocchio, urdfdom' datadir='${datarootdir}' datarootdir='${prefix}/share' docdir='${datarootdir}/doc/${PACKAGE_TARNAME}' dvidir='${docdir}' exec_prefix='NONE' host='x86_64-pc-linux-gnu' host_alias='' host_cpu='x86_64' host_os='linux-gnu' host_vendor='pc' htmldir='${docdir}' includedir='${prefix}/include' infodir='/opt/openrobots/info' install_sh='${SHELL} /local/robotpkg/var/tmp/robotpkg/wip/wamctrl-genom3/work/WAMCtrl-genom3-2.4/autoconf/install-sh' libdir='${exec_prefix}/lib' libexecdir='${exec_prefix}/libexec' localedir='${datarootdir}/locale' localstatedir='${prefix}/var' mandir='/opt/openrobots/man' mkdir_p='$(MKDIR_P)' oldincludedir='/usr/include' pdfdir='${docdir}' prefix='/opt/openrobots' program_transform_name='s,x,x,' psdir='${docdir}' requires_CFLAGS='-I/opt/openrobots/share/idl/openrobots2-idl -I/opt/openrobots/include' requires_LIBS='' requires_SPEC='openrobots2-idl >= 2.0, genom3 >= 2.99.41' runstatedir='${localstatedir}/run' sbindir='${exec_prefix}/sbin' sharedstatedir='${prefix}/com' sysconfdir='${prefix}/etc' target_alias='' ## ----------- ## ## confdefs.h. ## ## ----------- ## /* confdefs.h */ #define PACKAGE_NAME "wamctrl-genom3" #define PACKAGE_TARNAME "wamctrl-genom3" #define PACKAGE_VERSION "2.4" #define PACKAGE_STRING "wamctrl-genom3 2.4" #define PACKAGE_BUGREPORT "openrobots@laas.fr" #define PACKAGE_URL "" #define HAVE_STDIO_H 1 #define HAVE_STDLIB_H 1 #define HAVE_STRING_H 1 #define HAVE_INTTYPES_H 1 #define HAVE_STDINT_H 1 #define HAVE_STRINGS_H 1 #define HAVE_SYS_STAT_H 1 #define HAVE_SYS_TYPES_H 1 #define HAVE_UNISTD_H 1 #define STDC_HEADERS 1 #define HAVE_DLFCN_H 1 #define LT_OBJDIR ".libs/" configure: exit 1