robotpkg/wip/wamctrl-genom3 bulk build results
Log for wamctrl-genom3-2.4~codels+openprs+ros-client-c+ros-client-ros+ros-server on Ubuntu-20.04-x86_64: bulk.log (Back)
=> Checking for clear installation
===> Installing bootstrap dependencies for wamctrl-genom3-2.4~codels+openprs+ros-client-c+ros-client-ros+ros-server
=> Installing /opt/robotpkg/var/lib/robotpkg/packages/bsd/Ubuntu-20.04-x86_64/All/digest-20080510.tgz
=> Installing /opt/robotpkg/var/lib/robotpkg/packages/bsd/Ubuntu-20.04-x86_64/All/tnftp-20151004~ssl.tgz
===> Checking bootstrap dependencies for wamctrl-genom3-2.4~codels+openprs+ros-client-c+ros-client-ros+ros-server
=> Required robotpkg package digest>=20080510: digest-20080510 found
=> Required robotpkg package tnftp>=20130505~ssl: tnftp-20151004~ssl found
=> Required system package gnupg>=1: gnupg-2.2.19 found
=> Required system package gzip: gzip-1.10 found
=> Required system package pax and tar archivers: pax found
=> Required system package pkg_install>=20110805.12: pkg_install-20211115.4 found
=> Required system package pkgrepo2deb>=1.9: pkgrepo2deb-1.16 found
===> Done bootstrap-depends for wamctrl-genom3-2.4~codels+openprs+ros-client-c+ros-client-ros+ros-server
===> Installing full dependencies for wamctrl-genom3-2.4~codels+openprs+ros-client-c+ros-client-ros+ros-server
=> Installing /opt/robotpkg/var/lib/robotpkg/packages/bsd/Ubuntu-20.04-x86_64/All/coal-3.0.1.tgz
=> Dependency digest-20080510 already installed
=> Installing /opt/robotpkg/var/lib/robotpkg/packages/bsd/Ubuntu-20.04-x86_64/All/genom3-3.4.tgz
=> Installing /opt/robotpkg/var/lib/robotpkg/packages/bsd/Ubuntu-20.04-x86_64/All/genom3-openprs-1.0.10r1.tgz
=> Installing /opt/robotpkg/var/lib/robotpkg/packages/bsd/Ubuntu-20.04-x86_64/All/genom3-ros-1.36.tgz
=> Dependency openprs-1.1b14 already installed
=> Installing /opt/robotpkg/var/lib/robotpkg/packages/bsd/Ubuntu-20.04-x86_64/All/openrobots2-idl-2.3.2.tgz
=> Installing /opt/robotpkg/var/lib/robotpkg/packages/bsd/Ubuntu-20.04-x86_64/All/pinocchio-3.4.0.tgz
=> Dependency proxsuite-0.6.5r1 already installed
=> Dependency tnftp-20151004~ssl already installed
=> Dependency transgen3-1.0b6 already installed
===> Checking build options for wamctrl-genom3-2.4~codels+openprs+ros-client-c+ros-client-ros+ros-server
=> Building with the following options:
codels Build server codels
openprs Build an OpenPRS client
ros-client-c Build a ROS C client
ros-client-ros Build a ROS client
ros-server Build a ROS server
===> Checking alternatives for wamctrl-genom3-2.4~codels+openprs+ros-client-c+ros-client-ros+ros-server
=> Use the GNU C++ compiler: c++-compiler provided by g++>=3
=> Use the GNU C compiler: c-compiler provided by gcc>=4.9
=> Use python-3.8: python>=2.5 provided by python38>=3.8<3.9
===> Checking dependencies for wamctrl-genom3-2.4~codels+openprs+ros-client-c+ros-client-ros+ros-server
=> Required system package autoconf>=2.59: autoconf-2.69 found
=> Required system package automake>=1.8: automake-1.16.1 found
=> Required system package boost-headers>=1.34.1: boost-headers-1.71 found
=> Required system package boostlib-thread>=1.34.1: boost-libs-1.71.0 found
=> Required system package eigen3>=3: eigen3-3.3.7 found
=> Required system package g++>=3: g++-9.4.0 found
=> Required system package gcc>=4.9: gcc-9.4.0 found
=> Required system package GNU m4>=1.4: gm4-1.4.18 found
=> Required system package libstdc++: libstdc++ found
=> Required system package libtool>=1.5.22: libtool-2.4.6 found
=> Required system package pkg-config>=0.22: pkg-config-0.29.1 found
=> Required system package python38>=3.8<3.9: python38-3.8.10 found
=> Required system package ros-actionlib>=1.11: ros-actionlib-1.14.3 found
=> Required system package ros-comm>=1.13: ros-comm-1.17.4 found
=> Required system package ros-common-msgs>=1.12: ros-common-msgs-1.13.2 found
=> Required system package ros-genmsg>=0.5<0.7: ros-genmsg-0.6.1 found
=> Required system package ros-genpy>=0.6<0.7: ros-genpy-0.6.18 found
=> Required system package ros-message-generation>=0.4: ros-message-generation-0.4.1 found
=> Required system package ros-ros>=1.14: ros-ros-1.15.10 found
=> Required system package ros-rospack>=2.4: ros-rospack-2.6.4 found
=> Required system package urdfdom>=0.2.8: urdfdom-1.0.4 found
=> Required robotpkg package coal>=3: coal-3.0.1 found
=> Required robotpkg package genom3>=3.4: genom3-3.4 found
=> Required robotpkg package genom3-openprs>=1.0: genom3-openprs-1.0.10r1 found
=> Required robotpkg package genom3-ros>=1.35: genom3-ros-1.36 found
=> Required robotpkg package openprs>=1.1b7: openprs-1.1b14 found
=> Required robotpkg package openrobots2-idl>=2.0: openrobots2-idl-2.3.2 found
=> Required robotpkg package pinocchio>=2.3: pinocchio-3.4.0 found
=> Required robotpkg package proxsuite>=0.1: proxsuite-0.6.5r1 found
=> Required robotpkg package transgen3>=1.0b2: transgen3-1.0b6 found
===> Done depends for wamctrl-genom3-2.4~codels+openprs+ros-client-c+ros-client-ros+ros-server
===> Extracting for wamctrl-genom3-2.4~codels+openprs+ros-client-c+ros-client-ros+ros-server
=> SHA1 checksums OK
=> RMD160 checksums OK
An unexpected error occured. The last 10 log lines are shown below.
| WAMCtrl-genom3-2.4/example_files/mrsim-tilthex-plus-arm/model.config
| WAMCtrl-genom3-2.4/example_files/mrsim-tilthex-plus-arm/model.sdf
| WAMCtrl-genom3-2.4/example_files/tilthex_plus_arm_primitive_pinocchio.urdf
| WAMCtrl-genom3-2.4/example_files/wamctrl_overview.png
| WAMCtrl-genom3-2.4/wamctrl-genom3-uninstalled.pc.in
| WAMCtrl-genom3-2.4/wamctrl-genom3.pc.in
| WAMCtrl-genom3-2.4/wamctrl.gen
| Running set -e;cd /local/robotpkg/var/tmp/robotpkg/wip/wamctrl-genom3/work/WAMCtrl-genom3-2.4 && cd . && | test -f codels/wamctrl_c_types.h && | rm -f codels/wamctrl_c_types.h
For details or bug reports, check the complete log file in:
/local/robotpkg/var/tmp/robotpkg/wip/wamctrl-genom3/work/extract.log
make[3]: *** [../../architecture/genom3/module.mk:51: post-extract] Error 1
make[2]: *** [/local/robotpkg/var/lib/robotpkg/mk/pkg/package.mk:42: pkg-check-installed] Error 2
=> Marking wamctrl-genom3-2.4~codels+openprs+ros-client-c+ros-client-ros+ros-server as broken
ERROR: make: *** [package] Error 2
===> Deinstalling for wamctrl-genom3
Removing dependency pinocchio-3.4.0
Removed coal-3.0.1
Removed digest-20080510
Removing dependency eltclsh-1.21
Removing dependency
Removing dependency genom3-ros-1.36
Removing dependency transgen3-1.0b6
Removing dependency genom3-openprs-1.0.10r1
Removed genom3-3.4
Removed openrobots2-idl-2.3.2
Removed tnftp-20151004~ssl