robotpkg/wip/sot-torque-control bulk build results

sot-torque-control-1.6.5r1 (category wip or summary)

Platform Status Date Time Log files
Start Total brokenbrokenbybuildbulkcbbhcbbhbycmakeconfigureextract
Debian-11-x86_64N/A2026/09/3020:55:0500:00:14ViewView
cmake>=3.22
Debian-12-x86_64Broken2026/09/3021:36:3600:01:16
make: *** [package] Error 2
ViewViewViewViewView
Debian-13-x86_64Broken2026/09/3021:48:2000:01:28
make: *** [package] Error 2
ViewViewViewViewView
Fedora-42-x86_64Broken2026/09/3021:32:4400:01:40
make: *** [package] Error 2
ViewViewViewViewView
Fedora-44-x86_64Broken2026/09/3021:06:3000:00:08
Required robotpkg package ddp-actuator-solver>=1.0.0: BROKEN Required robotpkg package dynamic-graph-v3>=4.3.0: BROKEN Required robotpkg package parametric-curves>=1.0.0: BROKEN Required robotpkg package py314-sot-core-v3>=4.11.7<5.0.0: BROKEN
View
NetBSD-11-x86_64Broken2026/09/3021:55:1400:00:16
Required robotpkg package ddp-actuator-solver>=1.0.0: BROKEN Required robotpkg package dynamic-graph-v3>=4.3.0: BROKEN Required robotpkg package parametric-curves>=1.0.0: BROKEN Required robotpkg package py313-sot-core-v3>=4.11.7<5.0.0: BROKEN
View
Rocky-10-x86_64Broken2026/09/3021:16:3700:00:12
Required robotpkg package py312-sot-core-v3>=4.11.7<5.0.0: BROKEN
View
Rocky-8-x86_64N/A2026/09/3021:51:2900:00:08ViewView
pinocchio>=3
py36-sot-core-v3>=4.11.7<5.0.0
tsid>=1.6.0
Ubuntu-20.04-x86_64N/A2026/09/3021:13:0000:00:10ViewView
cmake>=3.22
py38-sot-core-v3>=4.11.7<5.0.0
Ubuntu-22.04-x86_64Broken2026/09/3021:46:4600:01:36
make: *** [package] Error 2
ViewViewViewViewView
Ubuntu-24.04-x86_64Broken2026/09/3021:35:1800:01:40
make: *** [package] Error 2
ViewViewViewViewView
Ubuntu-26.04-x86_64Broken2026/09/3021:10:3900:00:10
Required robotpkg package ddp-actuator-solver>=1.0.0: BROKEN Required robotpkg package dynamic-graph-v3>=4.3.0: BROKEN Required robotpkg package parametric-curves>=1.0.0: BROKEN Required robotpkg package py314-sot-core-v3>=4.11.7<5.0.0: BROKEN
View