| Platform | Status | Date | Time | Log files | ||||||||||
|---|---|---|---|---|---|---|---|---|---|---|---|---|---|---|
| Start | Total | broken | brokenby | build | bulk | cbbh | cbbhby | cmake | configure | extract | plist | |||
| Debian-11-x86_64 | N/A | 2026/09/30 | 20:56:04 | 00:00:09 | View | View | cmake>=3.22 | |||||||
| Debian-12-x86_64 | Broken | 2026/09/30 | 21:33:36 | 00:00:41 | make: *** [package] Error 2
| View | View | View | View | View | ||||
| Debian-13-x86_64 | Broken | 2026/09/30 | 21:43:22 | 00:00:34 | make: *** [package] Error 2
| View | View | View | View | View | ||||
| Fedora-42-x86_64 | Broken | 2026/09/30 | 21:36:47 | 00:00:41 | make: *** [package] Error 2
| View | View | View | View | View | ||||
| Fedora-44-x86_64 | Broken | 2026/09/30 | 21:07:02 | 00:00:06 | Required robotpkg package ddp-actuator-solver>=1.0.0: BROKEN
Required robotpkg package dynamic-graph-v3>=4.3.0: BROKEN
Required robotpkg package parametric-curves>=1.0.0: BROKEN
Required robotpkg package py314-sot-core-v3>=4.11.7<5.0.0: BROKEN
| View | ||||||||
| NetBSD-11-x86_64 | Broken | 2026/09/30 | 21:57:09 | 00:00:08 | Required robotpkg package ddp-actuator-solver>=1.0.0: BROKEN
Required robotpkg package dynamic-graph-v3>=4.3.0: BROKEN
Required robotpkg package parametric-curves>=1.0.0: BROKEN
Required robotpkg package py313-sot-core-v3>=4.11.7<5.0.0: BROKEN
| View | ||||||||
| Rocky-10-x86_64 | Broken | 2026/09/30 | 21:19:31 | 00:00:09 | Required robotpkg package py312-sot-core-v3>=4.11.7<5.0.0: BROKEN
| View | ||||||||
| Rocky-8-x86_64 | N/A | 2026/09/30 | 21:53:27 | 00:00:08 | View | View | pinocchio>=3 py36-sot-core-v3>=4.11.7<5.0.0 tsid>=1.6.0 | |||||||
| Ubuntu-20.04-x86_64 | Warnings | 2026/09/30 | 21:10:33 | 00:00:10 | View | View | cmake>=3.22 py38-sot-core-v3>=4.11.7<5.0.0 | View | ||||||
| Ubuntu-22.04-x86_64 | Broken | 2026/09/30 | 21:42:55 | 00:00:41 | make: *** [package] Error 2
| View | View | View | View | View | ||||
| Ubuntu-24.04-x86_64 | Broken | 2026/09/30 | 21:41:39 | 00:00:44 | make: *** [package] Error 2
| View | View | View | View | View | ||||
| Ubuntu-26.04-x86_64 | Broken | 2026/09/30 | 21:09:58 | 00:00:06 | Required robotpkg package ddp-actuator-solver>=1.0.0: BROKEN
Required robotpkg package dynamic-graph-v3>=4.3.0: BROKEN
Required robotpkg package parametric-curves>=1.0.0: BROKEN
Required robotpkg package py314-sot-core-v3>=4.11.7<5.0.0: BROKEN
| View | ||||||||