| Platform | Status | Date | Time | Log files | ||||||||||
|---|---|---|---|---|---|---|---|---|---|---|---|---|---|---|
| Start | Total | broken | brokenby | bulk | cbbh | cbbhby | cmake | configure | extract | plist | sysdep | |||
| Debian-11-x86_64 | N/A | 2026/09/ 9 | 02:54:14 | 00:00:09 | View | View | cmake>=3.22 | |||||||
| Debian-12-x86_64 | Broken | 2026/09/ 9 | 13:01:42 | 00:00:15 | make: *** [package] Error 2
| View | View | View | View | |||||
| Debian-13-x86_64 | Broken | 2026/09/ 9 | 09:41:29 | 00:00:09 | Required robotpkg package sot-dynamic-pinocchio-v3>=3.2.0<4.0.0: BROKEN
| View | ||||||||
| Fedora-42-x86_64 | Broken | 2026/09/ 8 | 18:04:34 | 00:00:09 | Required robotpkg package sot-dynamic-pinocchio-v3>=3.2.0<4.0.0: BROKEN
| View | ||||||||
| Fedora-44-x86_64 | Broken | 2026/09/ 9 | 07:11:10 | 00:00:08 | Required robotpkg package dynamic-graph-v3>=4.3.0: BROKEN
Required robotpkg package py314-dynamic-graph-bridge-v3>=3.0.0: BROKEN
Required robotpkg package py314-dynamic-graph-v3>=4.0.0: BROKEN
Required robotpkg package py314-sot-core-v3>=4.11.7<5.0.0: BROKEN
Required robotpkg package py314-sot-tools-v3>=2.0: BROKEN
Required robotpkg package sot-dynamic-pinocchio-v3>=3.2.0<4.0.0: BROKEN
| View | ||||||||
| NetBSD-10.0-x86_64 | N/A | 2026/09/ 9 | 11:38:53 | 00:00:24 | View | View | sot-dynamic-pinocchio-v3>=3.2.0<4.0.0 | |||||||
| Rocky-8-x86_64 | Sysdep | 2026/09/ 9 | 07:00:22 | 00:00:08 | View | View | eigen3>=3.3 pinocchio>=3 poco>=1 py36-pinocchio>=3.0.0 py36-sot-core-v3>=4.11.7<5.0.0 py36-sot-tools-v3>=2.0 sot-dynamic-pinocchio-v3>=3.2.0<4.0.0 | View | ||||||
| Ubuntu-20.04-x86_64 | Warnings | 2026/09/ 9 | 05:22:26 | 00:00:09 | View | View | cmake>=3.22 py38-dynamic-graph-bridge-v3>=3.0.0 py38-sot-core-v3>=4.11.7<5.0.0 py38-sot-tools-v3>=2.0 sot-dynamic-pinocchio-v3>=3.2.0<4.0.0 | View | ||||||
| Ubuntu-22.04-x86_64 | Broken | 2026/09/ 9 | 13:12:09 | 00:00:18 | make: *** [package] Error 2
| View | View | View | View | |||||
| Ubuntu-24.04-x86_64 | Broken | 2026/09/ 9 | 11:43:22 | 00:00:14 | make: *** [package] Error 2
| View | View | View | View | |||||
| Ubuntu-26.04-x86_64 | N/A | 2026/09/ 9 | 03:51:19 | 00:00:03 | View | View | boost-libs>=1.34.1 | |||||||