robotpkg/wip/py-sot-torque-control bulk build results

py27-sot-torque-control-1.5.3 (category wip or summary)

Platform Status Date Time Log files
Start Total brokenbuildbulkcbbhcbbhbycmakeconfigureextractsysdep
CentOS-7-x86_64Sysdep2020/10/1613:37:5000:00:14ViewView
cmake>=3.1.0
View
Debian-10-x86_64Broken2020/10/1612:32:3200:00:44
make: *** [package] Error 2
ViewViewViewViewView
Debian-8-x86_64Sysdep2020/10/1613:02:2000:00:18ViewView
cmake>=3.1.0
View
Debian-9-x86_64Broken2020/10/1618:25:4800:01:20
make: *** [package] Error 2
ViewViewViewViewView
Fedora-28-x86_64Broken2020/10/1619:03:5800:01:01
make: *** [package] Error 2
ViewViewViewViewView
Fedora-31-x86_64Sysdep2020/10/1614:46:1900:00:10ViewView
py-sphinx>=1.1
View
NetBSD-9.0-x86_64N/A2020/10/1613:43:0100:00:13ViewView
urdfdom-headers-1.0.4
Ubuntu-16.04-x86_64Broken2020/10/1617:53:1000:01:19
make: *** [package] Error 2
ViewViewViewViewView
Ubuntu-16.04.pal-x86_64Broken2020/10/1614:27:0400:00:42
make: *** [package] Error 2
ViewViewViewViewView
Ubuntu-18.04-x86_64Broken2020/10/1619:26:1300:00:53
make: *** [package] Error 2
ViewViewViewViewView
Ubuntu-20.04-x86_64Sysdep2020/10/1614:23:2600:00:14ViewView
boost-libs>=1.34.1
py-sphinx>=1.1
py27-numpy>=1
View

py34-sot-torque-control-1.5.3 (category wip or summary)

Platform Status Date Time Log files
Start Total bulkcbbhcbbhbysysdep
CentOS-7-x86_64Sysdep2020/10/1613:38:0500:00:13ViewView
boost-headers>=1.55
boost-libs>=1.34.1
cmake>=3.1.0
eigen3>=3.2.92
py-sphinx>=1.1
View
Debian-10-x86_64N/A2020/09/2422:20:4000:00:01ViewView
Debian-8-x86_64Sysdep2020/10/1613:02:3800:00:15ViewView
cmake>=3.1.0
View
Debian-9-x86_64N/A2020/09/2511:30:2100:00:00ViewView
Fedora-28-x86_64N/A2020/09/2512:28:3300:00:00ViewView
Fedora-31-x86_64N/A2020/09/2501:04:3000:00:00ViewView
NetBSD-9.0-x86_64N/A2020/09/2518:35:2700:00:01ViewView
Ubuntu-16.04-x86_64N/A2020/09/2511:09:5700:00:00ViewView
Ubuntu-16.04.pal-x86_64N/A2020/09/2423:35:1900:00:00ViewView
Ubuntu-18.04-x86_64N/A2020/09/2512:52:2800:00:01ViewView
Ubuntu-20.04-x86_64N/A2020/09/2423:11:3600:00:00ViewView

py35-sot-torque-control-1.5.3 (category wip or summary)

Platform Status Date Time Log files
Start Total brokenbuildbulkcbbhcmakeconfigureextract
CentOS-7-x86_64N/A2020/09/2500:05:5100:00:01ViewView
Debian-10-x86_64N/A2020/09/2422:20:4100:00:00ViewView
Debian-8-x86_64N/A2020/09/2501:16:0800:00:01ViewView
Debian-9-x86_64Broken2020/10/1618:27:0800:01:34
make: *** [package] Error 2
ViewViewViewViewView
Fedora-28-x86_64N/A2020/09/2512:28:3400:00:00ViewView
Fedora-31-x86_64N/A2020/09/2501:04:3000:00:00ViewView
NetBSD-9.0-x86_64N/A2020/09/2518:35:2800:00:01ViewView
Ubuntu-16.04-x86_64Broken2020/10/1617:54:2900:01:46
make: *** [package] Error 2
ViewViewViewViewView
Ubuntu-16.04.pal-x86_64Broken2020/10/1614:27:4600:00:44
make: *** [package] Error 2
ViewViewViewViewView
Ubuntu-18.04-x86_64N/A2020/09/2512:52:2900:00:00ViewView
Ubuntu-20.04-x86_64N/A2020/09/2423:11:3600:00:01ViewView

py36-sot-torque-control-1.5.3 (category wip or summary)

Platform Status Date Time Log files
Start Total brokenbuildbulkcbbhcbbhbycmakeconfigureextractsysdep
CentOS-7-x86_64N/A2020/09/2500:05:5300:00:01ViewView
Debian-10-x86_64N/A2020/09/2422:20:4100:00:00ViewView
Debian-8-x86_64N/A2020/09/2501:16:0900:00:00ViewView
Debian-9-x86_64N/A2020/09/2511:34:5100:00:01ViewView
Fedora-28-x86_64Broken2020/10/1619:05:0000:00:59
make: *** [package] Error 2
ViewViewViewViewView
Fedora-31-x86_64N/A2020/09/2501:04:3000:00:00ViewView
NetBSD-9.0-x86_64Sysdep2020/10/1613:43:1400:00:15ViewView
boost-libs>=1.34.1
py-sphinx>=1.1
py36-numpy>=1
urdfdom-headers-1.0.4
View
Ubuntu-16.04-x86_64N/A2020/09/2511:14:1300:00:01ViewView
Ubuntu-16.04.pal-x86_64N/A2020/09/2423:36:5200:00:00ViewView
Ubuntu-18.04-x86_64Broken2020/10/1619:27:0600:00:54
make: *** [package] Error 2
ViewViewViewViewView
Ubuntu-20.04-x86_64N/A2020/09/2423:11:3700:00:00ViewView

py37-sot-torque-control-1.5.3 (category wip or summary)

Platform Status Date Time Log files
Start Total brokenbuildbulkcbbhcmakeconfigureextract
CentOS-7-x86_64N/A2020/09/2500:05:5500:00:01ViewView
Debian-10-x86_64Broken2020/10/1612:33:1700:00:45
make: *** [package] Error 2
ViewViewViewViewView
Debian-8-x86_64N/A2020/09/2501:16:0900:00:01ViewView
Debian-9-x86_64N/A2020/09/2511:34:5200:00:00ViewView
Fedora-28-x86_64N/A2020/09/2512:31:5500:00:00ViewView
Fedora-31-x86_64Broken2020/10/1614:46:2900:00:45
make: *** [package] Error 2
ViewViewViewViewView
NetBSD-9.0-x86_64N/A2020/09/2518:35:4500:00:00ViewView
Ubuntu-16.04-x86_64N/A2020/09/2511:14:1400:00:01ViewView
Ubuntu-16.04.pal-x86_64N/A2020/09/2423:36:5200:00:00ViewView
Ubuntu-18.04-x86_64N/A2020/09/2512:55:5100:00:01ViewView
Ubuntu-20.04-x86_64N/A2020/09/2423:11:3700:00:00ViewView

py38-sot-torque-control-1.5.3 (category wip or summary)

Platform Status Date Time Log files
Start Total brokenbuildbulkcbbhcmakeconfigureextract
CentOS-7-x86_64N/A2020/09/2500:05:5700:00:01ViewView
Debian-10-x86_64N/A2020/09/2422:22:4600:00:00ViewView
Debian-8-x86_64N/A2020/09/2501:16:1000:00:00ViewView
Debian-9-x86_64N/A2020/09/2511:34:5300:00:00ViewView
Fedora-28-x86_64N/A2020/09/2512:31:5500:00:01ViewView
Fedora-31-x86_64N/A2020/09/2501:06:0900:00:00ViewView
NetBSD-9.0-x86_64N/A2020/09/2518:35:4600:00:00ViewView
Ubuntu-16.04-x86_64N/A2020/09/2511:14:1500:00:00ViewView
Ubuntu-16.04.pal-x86_64N/A2020/09/2423:36:5200:00:01ViewView
Ubuntu-18.04-x86_64N/A2020/09/2512:55:5200:00:00ViewView
Ubuntu-20.04-x86_64Broken2020/10/1614:23:4100:00:52
make: *** [package] Error 2
ViewViewViewViewView