robotpkg/wip/py-sot-pattern-generator-v3 bulk build results

py27-sot-pattern-generator-v3-3.4.2 (category wip or summary)

Platform Status Date Time Log files
Start Total bulkcbbhcbbhbyplist
Debian-11-x86_64N/A2026/09/1207:32:2000:00:00ViewView
Debian-12-x86_64N/A2026/09/1210:21:4900:00:00ViewView
Debian-13-x86_64N/A2026/09/1208:43:4400:00:01ViewView
Fedora-42-x86_64N/A2026/09/1209:00:5500:00:00ViewView
Fedora-44-x86_64N/A2026/09/1214:57:1600:00:01ViewView
NetBSD-10.0-x86_64N/A2026/09/1012:54:0100:00:01ViewView
NetBSD-11-x86_64N/A2026/09/1210:17:5900:00:00ViewView
Rocky-10-x86_64N/A2026/09/1207:45:4400:00:01ViewView
Rocky-8-x86_64N/A2026/09/1206:33:1200:00:00ViewView
Ubuntu-20.04-x86_64Warnings2026/09/1208:59:1400:00:09ViewView
boost-libs>=1.34.1
cmake>=3.22
py-sphinx>=1.1
py27-eigenpy-3.5.0
py27-numpy>=1
sot-pattern-generator-v3>=2.10
View
Ubuntu-22.04-x86_64N/A2026/09/1211:15:2100:00:14ViewView
boost-libs>=1.34.1
py-sphinx>=1.1
py27-eigenpy-3.5.0
py27-numpy>=1
Ubuntu-24.04-x86_64N/A2026/09/1210:17:5300:00:00ViewView
Ubuntu-26.04-x86_64N/A2026/09/1207:15:3700:00:00ViewView

py310-sot-pattern-generator-v3-3.4.2 (category wip or summary)

Platform Status Date Time Log files
Start Total brokenbuildbulkcbbhcmakeconfigureextract
Debian-11-x86_64N/A2026/09/1207:32:2000:00:01ViewView
Debian-12-x86_64N/A2026/09/1210:21:5000:00:00ViewView
Debian-13-x86_64N/A2026/09/1208:43:4500:00:00ViewView
Fedora-42-x86_64N/A2026/09/1209:00:5600:00:00ViewView
Fedora-44-x86_64N/A2026/09/1214:57:1700:00:01ViewView
NetBSD-10.0-x86_64N/A2026/09/1012:54:0200:00:01ViewView
NetBSD-11-x86_64N/A2026/09/1210:18:0000:00:01ViewView
Rocky-10-x86_64N/A2026/09/1207:45:4500:00:01ViewView
Rocky-8-x86_64N/A2026/09/1206:33:1300:00:00ViewView
Ubuntu-20.04-x86_64N/A2026/09/1208:59:2400:00:00ViewView
Ubuntu-22.04-x86_64Broken2026/09/1211:15:3600:00:55
make: *** [package] Error 2
ViewViewViewViewView
Ubuntu-24.04-x86_64N/A2026/09/1210:17:5300:00:01ViewView
Ubuntu-26.04-x86_64N/A2026/09/1207:15:3700:00:01ViewView

py311-sot-pattern-generator-v3-3.4.2 (category wip or summary)

Platform Status Date Time Log files
Start Total brokenbuildbulkcbbhcmakeconfigureextract
Debian-11-x86_64N/A2026/09/1207:32:2100:00:00ViewView
Debian-12-x86_64Broken2026/09/1210:21:5000:00:56
make: *** [package] Error 2
ViewViewViewViewView
Debian-13-x86_64N/A2026/09/1208:43:4500:00:01ViewView
Fedora-42-x86_64N/A2026/09/1209:00:5700:00:00ViewView
Fedora-44-x86_64N/A2026/09/1214:57:1800:00:01ViewView
NetBSD-10.0-x86_64Broken2026/09/1012:54:0300:01:15
/usr/pkg/bin/gmake: *** [package] Error 2
ViewViewViewViewView
NetBSD-11-x86_64N/A2026/09/1210:18:0100:00:01ViewView
Rocky-10-x86_64N/A2026/09/1207:45:4600:00:00ViewView
Rocky-8-x86_64N/A2026/09/1206:33:1400:00:00ViewView
Ubuntu-20.04-x86_64N/A2026/09/1208:59:2400:00:01ViewView
Ubuntu-22.04-x86_64N/A2026/09/1211:16:3200:00:00ViewView
Ubuntu-24.04-x86_64N/A2026/09/1210:17:5400:00:00ViewView
Ubuntu-26.04-x86_64N/A2026/09/1207:15:3800:00:00ViewView

py312-sot-pattern-generator-v3-3.4.2 (category wip or summary)

Platform Status Date Time Log files
Start Total brokenbrokenbybuildbulkcbbhcmakeconfigureextract
Debian-11-x86_64N/A2026/09/1207:32:2100:00:01ViewView
Debian-12-x86_64N/A2026/09/1210:22:4600:00:01ViewView
Debian-13-x86_64N/A2026/09/1208:43:4600:00:00ViewView
Fedora-42-x86_64N/A2026/09/1209:00:5800:00:00ViewView
Fedora-44-x86_64N/A2026/09/1214:57:1900:00:01ViewView
NetBSD-10.0-x86_64N/A2026/09/1012:55:1800:00:01ViewView
NetBSD-11-x86_64N/A2026/09/1210:18:0200:00:01ViewView
Rocky-10-x86_64Broken2026/09/1207:45:3400:00:10
Required robotpkg package jrl-walkgen-v3>=4.0.0: BROKEN Required robotpkg package py312-sot-core-v3>=4.11.7<5.0.0: BROKEN Required robotpkg package sot-pattern-generator-v3>=2.10: BROKEN
View
Rocky-8-x86_64N/A2026/09/1206:33:1400:00:01ViewView
Ubuntu-20.04-x86_64N/A2026/09/1208:59:2500:00:00ViewView
Ubuntu-22.04-x86_64N/A2026/09/1211:16:3200:00:01ViewView
Ubuntu-24.04-x86_64Broken2026/09/1210:17:5500:00:53
make: *** [package] Error 2
ViewViewViewViewView
Ubuntu-26.04-x86_64N/A2026/09/1207:15:3800:00:01ViewView

py313-sot-pattern-generator-v3-3.4.2 (category wip or summary)

Platform Status Date Time Log files
Start Total brokenbrokenbybuildbulkcbbhcmakeconfigureextract
Debian-11-x86_64N/A2026/09/1207:32:2200:00:00ViewView
Debian-12-x86_64N/A2026/09/1210:22:4700:00:00ViewView
Debian-13-x86_64Broken2026/09/1208:43:4600:00:57
make: *** [package] Error 2
ViewViewViewViewView
Fedora-42-x86_64Broken2026/09/1208:59:5900:00:55
make: *** [package] Error 2
ViewViewViewViewView
Fedora-44-x86_64N/A2026/09/1214:57:2000:00:01ViewView
NetBSD-10.0-x86_64N/A2026/09/1012:55:1900:00:01ViewView
NetBSD-11-x86_64Broken2026/09/1210:18:0400:00:15
Required robotpkg package jrl-walkgen-v3>=4.0.0: BROKEN Required robotpkg package py313-sot-core-v3>=4.11.7<5.0.0: BROKEN Required robotpkg package sot-pattern-generator-v3>=2.10: BROKEN
View
Rocky-10-x86_64N/A2026/09/1207:45:4700:00:00ViewView
Rocky-8-x86_64N/A2026/09/1206:33:1500:00:01ViewView
Ubuntu-20.04-x86_64N/A2026/09/1208:59:2600:00:00ViewView
Ubuntu-22.04-x86_64N/A2026/09/1211:16:3300:00:00ViewView
Ubuntu-24.04-x86_64N/A2026/09/1210:18:4800:00:00ViewView
Ubuntu-26.04-x86_64N/A2026/09/1207:15:3900:00:00ViewView

py314-sot-pattern-generator-v3-3.4.2 (category wip or summary)

Platform Status Date Time Log files
Start Total brokenbrokenbybulkcbbh
Debian-11-x86_64N/A2026/09/1207:32:2200:00:00ViewView
Debian-12-x86_64N/A2026/09/1210:22:4700:00:01ViewView
Debian-13-x86_64N/A2026/09/1208:44:4400:00:00ViewView
Fedora-42-x86_64N/A2026/09/1209:00:5800:00:01ViewView
Fedora-44-x86_64Broken2026/09/1214:57:0600:00:10
Required robotpkg package jrl-walkgen-v3>=4.0.0: BROKEN Required robotpkg package py314-sot-core-v3>=4.11.7<5.0.0: BROKEN Required robotpkg package sot-pattern-generator-v3>=2.10: BROKEN
View
NetBSD-10.0-x86_64N/A2026/09/1012:55:2000:00:01ViewView
NetBSD-11-x86_64N/A2026/09/1210:18:2000:00:00ViewView
Rocky-10-x86_64N/A2026/09/1207:45:4800:00:00ViewView
Rocky-8-x86_64N/A2026/09/1206:33:1600:00:00ViewView
Ubuntu-20.04-x86_64N/A2026/09/1208:59:2700:00:00ViewView
Ubuntu-22.04-x86_64N/A2026/09/1211:16:3400:00:00ViewView
Ubuntu-24.04-x86_64N/A2026/09/1210:18:4900:00:00ViewView
Ubuntu-26.04-x86_64Broken2026/09/1207:15:4000:00:09
Required robotpkg package jrl-walkgen-v3>=4.0.0: BROKEN Required robotpkg package py314-sot-core-v3>=4.11.7<5.0.0: BROKEN Required robotpkg package sot-pattern-generator-v3>=2.10: BROKEN
View

py36-sot-pattern-generator-v3-3.4.2 (category wip or summary)

Platform Status Date Time Log files
Start Total bulkcbbhcbbhby
Debian-11-x86_64N/A2026/09/1207:32:2300:00:00ViewView
Debian-12-x86_64N/A2026/09/1210:22:4800:00:00ViewView
Debian-13-x86_64N/A2026/09/1208:44:4400:00:00ViewView
Fedora-42-x86_64N/A2026/09/1209:00:5900:00:01ViewView
Fedora-44-x86_64N/A2026/09/1214:57:2100:00:00ViewView
NetBSD-10.0-x86_64N/A2026/09/1012:55:2100:00:01ViewView
NetBSD-11-x86_64N/A2026/09/1210:18:2100:00:00ViewView
Rocky-10-x86_64N/A2026/09/1207:45:4800:00:01ViewView
Rocky-8-x86_64N/A2026/09/1206:32:5800:00:14ViewView
jrl-walkgen-v3>=4.0.0
pinocchio>=3
py36-sot-core-v3>=4.11.7<5.0.0
sot-pattern-generator-v3>=2.10
Ubuntu-20.04-x86_64N/A2026/09/1208:59:2700:00:01ViewView
Ubuntu-22.04-x86_64N/A2026/09/1211:16:3400:00:01ViewView
Ubuntu-24.04-x86_64N/A2026/09/1210:18:4900:00:00ViewView
Ubuntu-26.04-x86_64N/A2026/09/1207:15:5000:00:00ViewView

py38-sot-pattern-generator-v3-3.4.2 (category wip or summary)

Platform Status Date Time Log files
Start Total bulkcbbhcbbhbyplist
Debian-11-x86_64N/A2026/09/1207:32:2300:00:00ViewView
Debian-12-x86_64N/A2026/09/1210:22:4800:00:00ViewView
Debian-13-x86_64N/A2026/09/1208:44:4500:00:00ViewView
Fedora-42-x86_64N/A2026/09/1209:01:0000:00:00ViewView
Fedora-44-x86_64N/A2026/09/1214:57:2200:00:00ViewView
NetBSD-10.0-x86_64N/A2026/09/1012:55:2200:00:01ViewView
NetBSD-11-x86_64N/A2026/09/1210:18:2100:00:01ViewView
Rocky-10-x86_64N/A2026/09/1207:45:4900:00:00ViewView
Rocky-8-x86_64N/A2026/09/1206:33:1700:00:00ViewView
Ubuntu-20.04-x86_64Warnings2026/09/1208:59:0200:00:11ViewView
cmake>=3.22
py38-sot-core-v3>=4.11.7<5.0.0
sot-pattern-generator-v3>=2.10
View
Ubuntu-22.04-x86_64N/A2026/09/1211:16:3500:00:01ViewView
Ubuntu-24.04-x86_64N/A2026/09/1210:18:5000:00:00ViewView
Ubuntu-26.04-x86_64N/A2026/09/1207:15:5000:00:01ViewView

py39-sot-pattern-generator-v3-3.4.2 (category wip or summary)

Platform Status Date Time Log files
Start Total bulkcbbhcbbhby
Debian-11-x86_64N/A2026/09/1207:32:2300:00:15ViewView
cmake>=3.22
Debian-12-x86_64N/A2026/09/1210:22:4900:00:00ViewView
Debian-13-x86_64N/A2026/09/1208:44:4500:00:00ViewView
Fedora-42-x86_64N/A2026/09/1209:01:0100:00:00ViewView
Fedora-44-x86_64N/A2026/09/1214:57:2300:00:00ViewView
NetBSD-10.0-x86_64N/A2026/09/1012:55:2300:00:01ViewView
NetBSD-11-x86_64N/A2026/09/1210:18:2200:00:01ViewView
Rocky-10-x86_64N/A2026/09/1207:45:5000:00:00ViewView
Rocky-8-x86_64N/A2026/09/1206:33:1800:00:00ViewView
Ubuntu-20.04-x86_64N/A2026/09/1208:59:2800:00:01ViewView
Ubuntu-22.04-x86_64N/A2026/09/1211:16:3600:00:00ViewView
Ubuntu-24.04-x86_64N/A2026/09/1210:18:5000:00:00ViewView
Ubuntu-26.04-x86_64N/A2026/09/1207:15:5100:00:00ViewView