robotpkg/wip/py-quadruped-walkgen bulk build results

py27-quadruped-walkgen-1.1.0r1 (category optimization or summary)

Platform Status Date Time Log files
Start Total bulkcbbhcbbhbysysdep
Debian-11-x86_64N/A2026/09/ 902:02:3500:00:00ViewView
Debian-12-x86_64N/A2026/09/ 912:18:1200:00:01ViewView
Debian-13-x86_64N/A2026/09/ 909:07:4700:00:01ViewView
Fedora-42-x86_64N/A2026/09/ 817:27:3700:00:01ViewView
Fedora-44-x86_64N/A2026/09/ 906:53:5600:00:01ViewView
NetBSD-10.0-x86_64N/A2026/09/ 911:09:3500:00:00ViewView
Rocky-8-x86_64N/A2026/09/ 906:47:3000:00:00ViewView
Ubuntu-20.04-x86_64Sysdep2026/09/ 904:36:0100:00:12ViewView
boost-libs>=1.34.1
cmake>=3.22
py27-eigenpy-3.5.0
py27-numpy>=1
py27-scipy>=0.17.0
View
Ubuntu-22.04-x86_64Sysdep2026/09/ 912:04:3500:00:14ViewView
boost-libs>=1.34.1
py27-eigenpy-3.5.0
py27-numpy>=1
py27-scipy>=0.17.0
View
Ubuntu-24.04-x86_64N/A2026/09/ 911:04:3700:00:00ViewView
Ubuntu-26.04-x86_64N/A2026/09/ 903:40:3100:00:00ViewView

py310-quadruped-walkgen-1.1.0r1 (category optimization or summary)

Platform Status Date Time Log files
Start Total brokenbulkcbbhcmakeconfigureextract
Debian-11-x86_64N/A2026/09/ 902:02:3500:00:01ViewView
Debian-12-x86_64N/A2026/09/ 912:18:1300:00:00ViewView
Debian-13-x86_64N/A2026/09/ 909:07:4800:00:01ViewView
Fedora-42-x86_64N/A2026/09/ 817:27:3800:00:01ViewView
Fedora-44-x86_64N/A2026/09/ 906:53:5700:00:01ViewView
NetBSD-10.0-x86_64N/A2026/09/ 911:09:3600:00:00ViewView
Rocky-8-x86_64N/A2026/09/ 906:47:3000:00:00ViewView
Ubuntu-20.04-x86_64N/A2026/09/ 904:36:1300:00:01ViewView
Ubuntu-22.04-x86_64Broken2026/09/ 912:04:4900:00:18
make: *** [package] Error 2
ViewViewViewView
Ubuntu-24.04-x86_64N/A2026/09/ 911:04:3800:00:00ViewView
Ubuntu-26.04-x86_64N/A2026/09/ 903:40:3100:00:00ViewView

py311-quadruped-walkgen-1.1.0r1 (category optimization or summary)

Platform Status Date Time Log files
Start Total brokenbulkcbbhcmakeconfigureextract
Debian-11-x86_64N/A2026/09/ 902:02:3600:00:00ViewView
Debian-12-x86_64Broken2026/09/ 912:18:1400:00:14
make: *** [package] Error 2
ViewViewViewView
Debian-13-x86_64N/A2026/09/ 909:07:4900:00:00ViewView
Fedora-42-x86_64N/A2026/09/ 817:27:3900:00:00ViewView
Fedora-44-x86_64N/A2026/09/ 906:53:5800:00:01ViewView
NetBSD-10.0-x86_64Broken2026/09/ 911:09:3700:00:27
/usr/pkg/bin/gmake: *** [package] Error 2
ViewViewViewView
Rocky-8-x86_64N/A2026/09/ 906:47:3100:00:00ViewView
Ubuntu-20.04-x86_64N/A2026/09/ 904:36:1400:00:01ViewView
Ubuntu-22.04-x86_64N/A2026/09/ 912:05:0700:00:01ViewView
Ubuntu-24.04-x86_64N/A2026/09/ 911:04:3800:00:01ViewView
Ubuntu-26.04-x86_64N/A2026/09/ 903:40:3200:00:00ViewView

py312-quadruped-walkgen-1.1.0r1 (category optimization or summary)

Platform Status Date Time Log files
Start Total brokenbulkcbbhcmakeconfigureextract
Debian-11-x86_64N/A2026/09/ 902:02:3600:00:01ViewView
Debian-12-x86_64N/A2026/09/ 912:18:2900:00:00ViewView
Debian-13-x86_64N/A2026/09/ 909:07:5000:00:00ViewView
Fedora-42-x86_64N/A2026/09/ 817:27:4000:00:00ViewView
Fedora-44-x86_64N/A2026/09/ 906:53:5900:00:01ViewView
NetBSD-10.0-x86_64N/A2026/09/ 911:10:0500:00:00ViewView
Rocky-8-x86_64N/A2026/09/ 906:47:3100:00:00ViewView
Ubuntu-20.04-x86_64N/A2026/09/ 904:36:1500:00:00ViewView
Ubuntu-22.04-x86_64N/A2026/09/ 912:05:0800:00:01ViewView
Ubuntu-24.04-x86_64Broken2026/09/ 911:04:3900:00:14
make: *** [package] Error 2
ViewViewViewView
Ubuntu-26.04-x86_64N/A2026/09/ 903:40:3200:00:00ViewView

py313-quadruped-walkgen-1.1.0r1 (category optimization or summary)

Platform Status Date Time Log files
Start Total brokenbulkcbbhcmakeconfigureextract
Debian-11-x86_64N/A2026/09/ 902:02:3700:00:00ViewView
Debian-12-x86_64N/A2026/09/ 912:18:3000:00:00ViewView
Debian-13-x86_64Broken2026/09/ 909:07:5000:00:16
make: *** [package] Error 2
ViewViewViewView
Fedora-42-x86_64Broken2026/09/ 817:27:4100:00:17
make: *** [package] Error 2
ViewViewViewView
Fedora-44-x86_64N/A2026/09/ 906:54:0000:00:01ViewView
NetBSD-10.0-x86_64N/A2026/09/ 911:10:0600:00:00ViewView
Rocky-8-x86_64N/A2026/09/ 906:47:3100:00:01ViewView
Ubuntu-20.04-x86_64N/A2026/09/ 904:36:1600:00:00ViewView
Ubuntu-22.04-x86_64N/A2026/09/ 912:05:0900:00:00ViewView
Ubuntu-24.04-x86_64N/A2026/09/ 911:04:5400:00:00ViewView
Ubuntu-26.04-x86_64N/A2026/09/ 903:40:3300:00:00ViewView

py314-quadruped-walkgen-1.1.0r1 (category optimization or summary)

Platform Status Date Time Log files
Start Total brokenbulkcbbhcbbhby
Debian-11-x86_64N/A2026/09/ 902:02:3700:00:01ViewView
Debian-12-x86_64N/A2026/09/ 912:18:3000:00:01ViewView
Debian-13-x86_64N/A2026/09/ 909:08:0700:00:00ViewView
Fedora-42-x86_64N/A2026/09/ 817:27:5800:00:01ViewView
Fedora-44-x86_64Broken2026/09/ 906:54:0100:00:09
Required robotpkg package py314-crocoddyl>=0.9.0: NOT found Required robotpkg package py314-example-robot-data>=3.6.0: NOT found Required robotpkg package py314-pinocchio>=3.0.0: NOT found
View
NetBSD-10.0-x86_64N/A2026/09/ 911:10:0700:00:00ViewView
Rocky-8-x86_64N/A2026/09/ 906:47:3200:00:00ViewView
Ubuntu-20.04-x86_64N/A2026/09/ 904:36:1600:00:01ViewView
Ubuntu-22.04-x86_64N/A2026/09/ 912:05:1000:00:00ViewView
Ubuntu-24.04-x86_64N/A2026/09/ 911:04:5400:00:01ViewView
Ubuntu-26.04-x86_64N/A2026/09/ 903:40:3300:00:08ViewView
boost-libs>=1.34.1

py36-quadruped-walkgen-1.1.0r1 (category optimization or summary)

Platform Status Date Time Log files
Start Total bulkcbbhcbbhbysysdep
Debian-11-x86_64N/A2026/09/ 902:02:3800:00:00ViewView
Debian-12-x86_64N/A2026/09/ 912:18:3100:00:00ViewView
Debian-13-x86_64N/A2026/09/ 909:08:0700:00:01ViewView
Fedora-42-x86_64N/A2026/09/ 817:27:5900:00:01ViewView
Fedora-44-x86_64N/A2026/09/ 906:54:1000:00:01ViewView
NetBSD-10.0-x86_64N/A2026/09/ 911:10:0800:00:00ViewView
Rocky-8-x86_64Sysdep2026/09/ 906:47:3200:00:08ViewView
eigen3>=3.3
pinocchio>=3
py36-crocoddyl>=0.9.0
py36-example-robot-data>=3.6.0
py36-pinocchio>=3.0.0
View
Ubuntu-20.04-x86_64N/A2026/09/ 904:36:1700:00:00ViewView
Ubuntu-22.04-x86_64N/A2026/09/ 912:05:1100:00:00ViewView
Ubuntu-24.04-x86_64N/A2026/09/ 911:04:5500:00:00ViewView
Ubuntu-26.04-x86_64N/A2026/09/ 903:40:4200:00:00ViewView

py38-quadruped-walkgen-1.1.0r1 (category optimization or summary)

Platform Status Date Time Log files
Start Total bulkcbbhcbbhby
Debian-11-x86_64N/A2026/09/ 902:02:3800:00:01ViewView
Debian-12-x86_64N/A2026/09/ 912:18:3200:00:00ViewView
Debian-13-x86_64N/A2026/09/ 909:08:0800:00:01ViewView
Fedora-42-x86_64N/A2026/09/ 817:28:0000:00:01ViewView
Fedora-44-x86_64N/A2026/09/ 906:54:1100:00:00ViewView
NetBSD-10.0-x86_64N/A2026/09/ 911:10:0900:00:01ViewView
Rocky-8-x86_64N/A2026/09/ 906:47:4000:00:00ViewView
Ubuntu-20.04-x86_64N/A2026/09/ 904:36:1800:00:08ViewView
cmake>=3.22
Ubuntu-22.04-x86_64N/A2026/09/ 912:05:1100:00:01ViewView
Ubuntu-24.04-x86_64N/A2026/09/ 911:04:5600:00:00ViewView
Ubuntu-26.04-x86_64N/A2026/09/ 903:40:4200:00:01ViewView

py39-quadruped-walkgen-1.1.0r1 (category optimization or summary)

Platform Status Date Time Log files
Start Total bulkcbbhcbbhby
Debian-11-x86_64N/A2026/09/ 902:02:3900:00:08ViewView
cmake>=3.22
Debian-12-x86_64N/A2026/09/ 912:18:3300:00:00ViewView
Debian-13-x86_64N/A2026/09/ 909:08:0900:00:00ViewView
Fedora-42-x86_64N/A2026/09/ 817:28:0100:00:01ViewView
Fedora-44-x86_64N/A2026/09/ 906:54:1200:00:00ViewView
NetBSD-10.0-x86_64N/A2026/09/ 911:10:1000:00:01ViewView
Rocky-8-x86_64N/A2026/09/ 906:47:4100:00:00ViewView
Ubuntu-20.04-x86_64N/A2026/09/ 904:36:2600:00:01ViewView
Ubuntu-22.04-x86_64N/A2026/09/ 912:05:1200:00:00ViewView
Ubuntu-24.04-x86_64N/A2026/09/ 911:04:5600:00:01ViewView
Ubuntu-26.04-x86_64N/A2026/09/ 903:40:4300:00:00ViewView