robotpkg/wip/py-quadruped-walkgen bulk build results
Log for py314-quadruped-walkgen-1.1.0r1 on Ubuntu-26.04-x86_64: bulk.log (Back)
=> Checking for clear installation
===> Installing bootstrap dependencies for py314-quadruped-walkgen-1.1.0r1
=> Installing /opt/robotpkg/var/lib/robotpkg/packages/bsd/Ubuntu-26.04-x86_64/All/digest-20080510.tgz
=> Installing /opt/robotpkg/var/lib/robotpkg/packages/bsd/Ubuntu-26.04-x86_64/All/tnftp-20151004~ssl.tgz
===> Checking bootstrap dependencies for py314-quadruped-walkgen-1.1.0r1
=> Required robotpkg package digest>=20080510: digest-20080510 found
=> Required robotpkg package tnftp>=20130505~ssl: tnftp-20151004~ssl found
=> Required system package gnupg>=1: gnupg-2.4.8 found
=> Required system package gzip: gzip-1.14 found
=> Required system package patch>=2.0: patch-2.8~posix found
=> Required system package pax and tar archivers: pax found
=> Required system package pkg_install>=20110805.12: pkg_install-20211115.4 found
=> Required system package pkgrepo2deb>=1.9: pkgrepo2deb-1.16 found
===> Done bootstrap-depends for py314-quadruped-walkgen-1.1.0r1
===> Installing full dependencies for py314-quadruped-walkgen-1.1.0r1
=> Installing /opt/robotpkg/var/lib/robotpkg/packages/bsd/Ubuntu-26.04-x86_64/All/coal-3.0.4.tgz
=> Dependency digest-20080510 already installed
=> Installing /opt/robotpkg/var/lib/robotpkg/packages/bsd/Ubuntu-26.04-x86_64/All/example-robot-data-5.0.0.tgz
=> Dependency jrl-cmakemodules-2.1.0 already installed
=> Installing /opt/robotpkg/var/lib/robotpkg/packages/bsd/Ubuntu-26.04-x86_64/All/pinocchio-4.1.0.tgz
=> Installing /opt/robotpkg/var/lib/robotpkg/packages/bsd/Ubuntu-26.04-x86_64/All/py314-crocoddyl-3.2.1r1.tgz
=> Dependency py314-eigenpy-3.13.0 already installed
=> Dependency py314-example-robot-data-5.0.0 already installed
=> Dependency py314-pinocchio-4.1.0 already installed
=> Dependency tnftp-20151004~ssl already installed
===> Checking build options for py314-quadruped-walkgen-1.1.0r1
=> Building with no option.
===> Checking alternatives for py314-quadruped-walkgen-1.1.0r1
=> Use the GNU C++ compiler: c++-compiler provided by g++>=3
=> Use the GNU C compiler: c-compiler provided by gcc>=3
=> Use python-3.14: python>=2.5 provided by python314>=3.14<3.15
===> Checking dependencies for py314-quadruped-walkgen-1.1.0r1
=> Required system package assimp>=3.0: assimp-6.0.4 found
=> Required system package boost-headers>=1.34.1: boost-headers-1.90 found
=> Required system package boostlib-python>=1.34.1: boost-libs-1.90.0 found
=> Required system package cmake>=3.10: cmake-4.2.3 found
=> Required system package eigen3>=3.3: eigen3-3.4.0 found
=> Required system package g++>=3: g++-15.2.0 found
=> Required system package gcc>=3: gcc-15.2.0 found
=> Required system package libstdc++: libstdc++ found
=> Required system package octomap>=1.6.0: octomap-1.10.0 found
=> Required system package pkg-config>=0.22: pkg-config-2.5.1 found
=> Required system package py314-numpy>=1: py314-numpy-2.3.5 found
=> Required system package py314-scipy>=0.17.0: py314-scipy-1.16.3 found
=> Required system package python314>=3.14<3.15: python314-3.14.4 found
=> Required system package urdfdom>=0.2.8: urdfdom-5.1.0 found
=> Required robotpkg package coal>=3: coal-3.0.4 found
=> Required robotpkg package example-robot-data>=4.1: example-robot-data-5.0.0 found
=> Required robotpkg package jrl-cmakemodules>=1.1.0: jrl-cmakemodules-2.1.0 found
=> Required robotpkg package pinocchio>=3: pinocchio-4.1.0 found
=> Required robotpkg package py314-crocoddyl>=0.9.0: py314-crocoddyl-3.2.1r1 found
=> Required robotpkg package py314-eigenpy>=2.7.10: py314-eigenpy-3.13.0 found
=> Required robotpkg package py314-example-robot-data>=3.6.0: py314-example-robot-data-5.0.0 found
=> Required robotpkg package py314-pinocchio>=3.0.0: py314-pinocchio-4.1.0 found
===> Done depends for py314-quadruped-walkgen-1.1.0r1
===> Extracting for py314-quadruped-walkgen-1.1.0r1
=> SHA1 checksums OK
=> RMD160 checksums OK
===> Patching for py314-quadruped-walkgen-1.1.0r1
=> Applying robotpkg patches for py314-quadruped-walkgen-1.1.0r1
===> Configuring for py314-quadruped-walkgen-1.1.0r1
CMake Warning (dev) at /usr/share/cmake-4.2/Modules/CMakeFindDependencyMacro.cmake:93 (find_package):
Policy CMP0167 is not set: The FindBoost module is removed. Run "cmake
--help-policy CMP0167" for policy details. Use the cmake_policy command to
set the policy and suppress this warning.
Call Stack (most recent call first):
/usr/share/cmake-4.2/Modules/CMakeFindDependencyMacro.cmake:125 (__find_dependency_common)
/opt/openrobots/lib/cmake/pinocchio/pinocchioConfig.cmake:185 (find_dependency)
/usr/share/cmake-4.2/Modules/CMakeFindDependencyMacro.cmake:93 (find_package)
/usr/share/cmake-4.2/Modules/CMakeFindDependencyMacro.cmake:125 (__find_dependency_common)
/opt/openrobots/lib/cmake/crocoddyl/crocoddylConfig.cmake:177 (find_dependency)
cmake/package-config.cmake:110 (find_package)
CMakeLists.txt:43 (add_project_dependency)
This warning is for project developers. Use -Wno-dev to suppress it.
CMake Warning (dev) at /usr/share/cmake-4.2/Modules/CMakeFindDependencyMacro.cmake:93 (find_package):
Policy CMP0167 is not set: The FindBoost module is removed. Run "cmake
--help-policy CMP0167" for policy details. Use the cmake_policy command to
set the policy and suppress this warning.
Call Stack (most recent call first):
/usr/share/cmake-4.2/Modules/CMakeFindDependencyMacro.cmake:125 (__find_dependency_common)
/opt/openrobots/lib/cmake/coal/coalConfig.cmake:179 (find_dependency)
/usr/share/cmake-4.2/Modules/CMakeFindDependencyMacro.cmake:93 (find_package)
/usr/share/cmake-4.2/Modules/CMakeFindDependencyMacro.cmake:125 (__find_dependency_common)
/opt/openrobots/lib/cmake/pinocchio/pinocchioConfig.cmake:186 (find_dependency)
/usr/share/cmake-4.2/Modules/CMakeFindDependencyMacro.cmake:93 (find_package)
/usr/share/cmake-4.2/Modules/CMakeFindDependencyMacro.cmake:125 (__find_dependency_common)
/opt/openrobots/lib/cmake/crocoddyl/crocoddylConfig.cmake:177 (find_dependency)
cmake/package-config.cmake:110 (find_package)
CMakeLists.txt:43 (add_project_dependency)
This warning is for project developers. Use -Wno-dev to suppress it.
CMake Warning (dev) at /usr/share/cmake-4.2/Modules/CMakeFindDependencyMacro.cmake:93 (find_package):
Policy CMP0167 is not set: The FindBoost module is removed. Run "cmake
--help-policy CMP0167" for policy details. Use the cmake_policy command to
set the policy and suppress this warning.
Call Stack (most recent call first):
/usr/share/cmake-4.2/Modules/CMakeFindDependencyMacro.cmake:125 (__find_dependency_common)
/opt/openrobots/lib/cmake/crocoddyl/crocoddylConfig.cmake:178 (find_dependency)
cmake/package-config.cmake:110 (find_package)
CMakeLists.txt:43 (add_project_dependency)
This warning is for project developers. Use -Wno-dev to suppress it.
CMake Warning (dev) at CMakeLists.txt:45 (find_package):
Policy CMP0167 is not set: The FindBoost module is removed. Run "cmake
--help-policy CMP0167" for policy details. Use the cmake_policy command to
set the policy and suppress this warning.
This warning is for project developers. Use -Wno-dev to suppress it.
CMake Error at /usr/share/cmake-4.2/Modules/FindPackageHandleStandardArgs.cmake:290 (message):
Could NOT find Boost (missing: system) (found version "1.90.0")
Call Stack (most recent call first):
/usr/share/cmake-4.2/Modules/FindPackageHandleStandardArgs.cmake:654 (_FPHSA_FAILURE_MESSAGE)
/usr/share/cmake-4.2/Modules/FindBoost.cmake:2440 (find_package_handle_standard_args)
CMakeLists.txt:45 (find_package)
An unexpected error occured. The last 10 log lines are shown below.
|
| CMake Error at /usr/share/cmake-4.2/Modules/FindPackageHandleStandardArgs.cmake:290 (message):
| Could NOT find Boost (missing: system) (found version "1.90.0")
| Call Stack (most recent call first):
| /usr/share/cmake-4.2/Modules/FindPackageHandleStandardArgs.cmake:654 (_FPHSA_FAILURE_MESSAGE)
| /usr/share/cmake-4.2/Modules/FindBoost.cmake:2440 (find_package_handle_standard_args)
| CMakeLists.txt:45 (find_package)
|
|
| -- Configuring incomplete, errors occurred!
For details or bug reports, check the complete log file in:
/local/robotpkg/var/tmp/robotpkg/wip/py-quadruped-walkgen/work/configure.log
make[3]: *** [/local/robotpkg/var/lib/robotpkg/mk/configure/cmake-configure.mk:101: do-configure-cmake(/local/robotpkg/var/tmp/robotpkg/wip/py-quadruped-walkgen/work/quadruped-walkgen-1.1.0)] Error 1
make[2]: *** [/local/robotpkg/var/lib/robotpkg/mk/pkg/package.mk:42: pkg-check-installed] Error 2
=> Marking py314-quadruped-walkgen-1.1.0r1 as broken
ERROR: make: *** [package] Error 2
===> Deinstalling for py314-quadruped-walkgen
Removing dependency jrl-cmakemodules-2.1.0
Removing dependency
Removing dependency py314-coal-3.0.4
Removing dependency pinocchio-4.1.0
Removing dependency py314-pinocchio-4.1.0
Removing dependency py314-example-robot-data-5.0.0
Removing dependency crocoddyl-3.2.1r1
Removing dependency py314-crocoddyl-3.2.1r1
Removed coal-3.0.4
Removed digest-20080510
Removed tnftp-20151004~ssl