robotpkg/wip/py-pal bulk build results

py27-pal-python-0.9.14os1 (category wip or summary)

Platform Status Date Time Log files
Start Total bulkcbbhcbbhbysysdep
Debian-11-x86_64N/A2026/09/1802:22:3200:00:00ViewView
Debian-12-x86_64N/A2026/09/1806:33:5300:00:00ViewView
Debian-13-x86_64N/A2026/09/1804:08:3200:00:00ViewView
Fedora-42-x86_64N/A2026/09/1808:49:5600:00:00ViewView
Fedora-44-x86_64N/A2026/09/1807:39:0300:00:00ViewView
NetBSD-11-x86_64N/A2026/09/1811:41:4100:00:00ViewView
Rocky-10-x86_64N/A2026/09/1804:40:1700:00:00ViewView
Rocky-8-x86_64N/A2026/09/1800:48:0400:00:01ViewView
Ubuntu-20.04-x86_64Sysdep2026/09/3021:05:4100:00:02ViewView
py27-catkin-pkg>=0.2
py27-pyparsing
View
Ubuntu-22.04-x86_64Sysdep2026/09/3021:21:3100:00:04ViewView
py27-pyparsing
View
Ubuntu-24.04-x86_64N/A2026/09/1806:00:0200:00:01ViewView
Ubuntu-26.04-x86_64N/A2026/09/1805:13:4200:00:00ViewView

py310-pal-python-0.9.14os1 (category wip or summary)

Platform Status Date Time Log files
Start Total brokenbuildbulkcbbhconfigureextractinstall
Debian-11-x86_64N/A2026/09/1802:22:3200:00:01ViewView
Debian-12-x86_64N/A2026/09/1806:33:5300:00:00ViewView
Debian-13-x86_64N/A2026/09/1804:08:3300:00:00ViewView
Fedora-42-x86_64N/A2026/09/1808:49:5600:00:01ViewView
Fedora-44-x86_64N/A2026/09/1807:39:0400:00:00ViewView
NetBSD-11-x86_64N/A2026/09/1811:41:4200:00:00ViewView
Rocky-10-x86_64N/A2026/09/1804:40:1800:00:00ViewView
Rocky-8-x86_64N/A2026/09/1800:48:0500:00:00ViewView
Ubuntu-20.04-x86_64N/A2026/09/2117:39:3300:00:01ViewView
Ubuntu-22.04-x86_64Broken2026/09/3021:21:2400:00:07
make: *** [package] Error 2
ViewViewViewViewView
Ubuntu-24.04-x86_64N/A2026/09/1806:00:0300:00:00ViewView
Ubuntu-26.04-x86_64N/A2026/09/1805:13:4200:00:01ViewView

py311-pal-python-0.9.14os1 (category wip or summary)

Platform Status Date Time Log files
Start Total brokenbuildbulkcbbhconfigureextractinstall
Debian-11-x86_64N/A2026/09/1802:22:3300:00:00ViewView
Debian-12-x86_64Broken2026/09/3021:01:2500:00:10
make: *** [package] Error 2
ViewViewViewViewView
Debian-13-x86_64N/A2026/09/1804:08:3300:00:00ViewView
Fedora-42-x86_64N/A2026/09/1808:49:5700:00:00ViewView
Fedora-44-x86_64N/A2026/09/1807:39:0400:00:01ViewView
NetBSD-11-x86_64N/A2026/09/1811:41:4200:00:01ViewView
Rocky-10-x86_64N/A2026/09/1804:40:1800:00:00ViewView
Rocky-8-x86_64N/A2026/09/1800:48:0500:00:00ViewView
Ubuntu-20.04-x86_64N/A2026/09/2117:39:3400:00:00ViewView
Ubuntu-22.04-x86_64N/A2026/09/1807:18:4400:00:00ViewView
Ubuntu-24.04-x86_64N/A2026/09/1806:00:0300:00:00ViewView
Ubuntu-26.04-x86_64N/A2026/09/1805:13:4300:00:00ViewView

py312-pal-python-0.9.14os1 (category wip or summary)

Platform Status Date Time Log files
Start Total brokenbuildbulkcbbhconfigureextractinstallplist
Debian-11-x86_64N/A2026/09/1802:22:3300:00:00ViewView
Debian-12-x86_64N/A2026/09/1806:33:5300:00:01ViewView
Debian-13-x86_64N/A2026/09/1804:08:3300:00:00ViewView
Fedora-42-x86_64N/A2026/09/1808:49:5800:00:00ViewView
Fedora-44-x86_64N/A2026/09/1807:39:0500:00:00ViewView
NetBSD-11-x86_64N/A2026/09/1811:41:4300:00:01ViewView
Rocky-10-x86_64Broken2026/09/3020:46:5000:00:32
make: *** [package] Error 2
ViewViewViewViewViewView
Rocky-8-x86_64N/A2026/09/1800:48:0500:00:00ViewView
Ubuntu-20.04-x86_64N/A2026/09/2117:39:3500:00:00ViewView
Ubuntu-22.04-x86_64N/A2026/09/1807:18:4500:00:00ViewView
Ubuntu-24.04-x86_64Broken2026/09/3021:07:4000:00:12
make: *** [package] Error 2
ViewViewViewViewViewView
Ubuntu-26.04-x86_64N/A2026/09/1805:13:4300:00:01ViewView

py313-pal-python-0.9.14os1 (category wip or summary)

Platform Status Date Time Log files
Start Total brokenbuildbulkcbbhconfigureextractinstallplist
Debian-11-x86_64N/A2026/09/1802:22:3300:00:00ViewView
Debian-12-x86_64N/A2026/09/1806:33:5400:00:00ViewView
Debian-13-x86_64Broken2026/09/3021:12:4600:00:14
make: *** [package] Error 2
ViewViewViewViewViewView
Fedora-42-x86_64Broken2026/09/3021:19:1000:00:07
make: *** [package] Error 2
ViewViewViewViewViewView
Fedora-44-x86_64N/A2026/09/1807:39:0500:00:01ViewView
NetBSD-11-x86_64Broken2026/09/3021:41:3300:00:06
/usr/pkg/bin/gmake: *** [package] Error 2
ViewViewViewViewViewView
Rocky-10-x86_64N/A2026/09/1804:40:2300:00:00ViewView
Rocky-8-x86_64N/A2026/09/1800:48:0600:00:00ViewView
Ubuntu-20.04-x86_64N/A2026/09/2117:39:3500:00:01ViewView
Ubuntu-22.04-x86_64N/A2026/09/1807:18:4500:00:00ViewView
Ubuntu-24.04-x86_64N/A2026/09/1806:00:0400:00:00ViewView
Ubuntu-26.04-x86_64N/A2026/09/1805:13:4400:00:00ViewView

py314-pal-python-0.9.14os1 (category wip or summary)

Platform Status Date Time Log files
Start Total buildbulkcbbhconfigureextractinstallpkgplist
Debian-11-x86_64N/A2026/09/1802:22:3400:00:00ViewView
Debian-12-x86_64N/A2026/09/1806:33:5400:00:00ViewView
Debian-13-x86_64N/A2026/09/1804:08:3400:00:00ViewView
Fedora-42-x86_64N/A2026/09/1808:50:0500:00:00ViewView
Fedora-44-x86_64Warnings2026/09/1807:39:0600:00:08ViewViewViewViewViewView
NetBSD-11-x86_64N/A2026/09/1811:41:4400:00:00ViewView
Rocky-10-x86_64N/A2026/09/1804:40:2400:00:00ViewView
Rocky-8-x86_64N/A2026/09/1800:48:0600:00:00ViewView
Ubuntu-20.04-x86_64N/A2026/09/2117:39:3600:00:00ViewView
Ubuntu-22.04-x86_64N/A2026/09/1807:18:4600:00:00ViewView
Ubuntu-24.04-x86_64N/A2026/09/1806:00:0400:00:00ViewView
Ubuntu-26.04-x86_64Warnings2026/09/1805:13:3600:00:06ViewViewViewViewViewViewView

py36-pal-python-0.9.14os1 (category wip or summary)

Platform Status Date Time Log files
Start Total brokenbuildbulkcbbhconfigureextractinstall
Debian-11-x86_64N/A2026/09/1802:22:3400:00:00ViewView
Debian-12-x86_64N/A2026/09/1806:33:5500:00:00ViewView
Debian-13-x86_64N/A2026/09/1804:08:3400:00:00ViewView
Fedora-42-x86_64N/A2026/09/1808:50:0600:00:00ViewView
Fedora-44-x86_64N/A2026/09/1807:39:1400:00:00ViewView
NetBSD-11-x86_64N/A2026/09/1811:41:4500:00:00ViewView
Rocky-10-x86_64N/A2026/09/1804:40:2400:00:01ViewView
Rocky-8-x86_64Broken2026/09/3021:31:5400:00:04
make: *** [package] Error 2
ViewViewViewViewView
Ubuntu-20.04-x86_64N/A2026/09/2117:39:3700:00:00ViewView
Ubuntu-22.04-x86_64N/A2026/09/1807:18:4600:00:00ViewView
Ubuntu-24.04-x86_64N/A2026/09/1806:00:0400:00:00ViewView
Ubuntu-26.04-x86_64N/A2026/09/1805:13:4400:00:01ViewView

py38-pal-python-0.9.14os1 (category wip or summary)

Platform Status Date Time Log files
Start Total brokenbuildbulkcbbhconfigureextractinstall
Debian-11-x86_64N/A2026/09/1802:22:3400:00:00ViewView
Debian-12-x86_64N/A2026/09/1806:33:5500:00:00ViewView
Debian-13-x86_64N/A2026/09/1804:08:3400:00:00ViewView
Fedora-42-x86_64N/A2026/09/1808:50:0600:00:01ViewView
Fedora-44-x86_64N/A2026/09/1807:39:1500:00:00ViewView
NetBSD-11-x86_64N/A2026/09/1811:41:4600:00:00ViewView
Rocky-10-x86_64N/A2026/09/1804:40:2500:00:00ViewView
Rocky-8-x86_64N/A2026/09/1800:48:1000:00:00ViewView
Ubuntu-20.04-x86_64Broken2026/09/3021:05:4300:00:04
make: *** [package] Error 2
ViewViewViewViewView
Ubuntu-22.04-x86_64N/A2026/09/1807:18:4700:00:00ViewView
Ubuntu-24.04-x86_64N/A2026/09/1806:00:0500:00:00ViewView
Ubuntu-26.04-x86_64N/A2026/09/1805:13:4500:00:00ViewView

py39-pal-python-0.9.14os1 (category wip or summary)

Platform Status Date Time Log files
Start Total brokenbuildbulkcbbhconfigureextractinstall
Debian-11-x86_64Broken2026/09/3020:54:5500:00:04
make: *** [package] Error 2
ViewViewViewViewView
Debian-12-x86_64N/A2026/09/1806:33:5500:00:01ViewView
Debian-13-x86_64N/A2026/09/1804:08:3500:00:00ViewView
Fedora-42-x86_64N/A2026/09/1808:50:0700:00:00ViewView
Fedora-44-x86_64N/A2026/09/1807:39:1500:00:01ViewView
NetBSD-11-x86_64N/A2026/09/1811:41:4600:00:01ViewView
Rocky-10-x86_64N/A2026/09/1804:40:2500:00:01ViewView
Rocky-8-x86_64N/A2026/09/1800:48:1000:00:00ViewView
Ubuntu-20.04-x86_64N/A2026/09/2117:39:4300:00:00ViewView
Ubuntu-22.04-x86_64N/A2026/09/1807:18:4700:00:00ViewView
Ubuntu-24.04-x86_64N/A2026/09/1806:00:0500:00:00ViewView
Ubuntu-26.04-x86_64N/A2026/09/1805:13:4600:00:00ViewView