robotpkg/wip/py-pal bulk build results

Log for py310-pal-python-0.9.14os1 on Ubuntu-22.04-x86_64: bulk.log (Back)

=> Checking for clear installation ===> Installing bootstrap dependencies for py310-pal-python-0.9.14os1 => Installing /opt/robotpkg/var/lib/robotpkg/packages/bsd/Ubuntu-22.04-x86_64/All/digest-20080510.tgz => Installing /opt/robotpkg/var/lib/robotpkg/packages/bsd/Ubuntu-22.04-x86_64/All/tnftp-20151004~ssl.tgz ===> Checking bootstrap dependencies for py310-pal-python-0.9.14os1 => Required robotpkg package digest>=20080510: digest-20080510 found => Required robotpkg package tnftp>=20091122: tnftp-20151004~ssl found => Required system package gnupg>=1: gnupg-2.2.27 found => Required system package gzip: gzip-1.10 found => Required system package pax and tar archivers: pax found => Required system package pkg_install>=20110805.12: pkg_install-20211115.4 found => Required system package pkgrepo2deb>=1.9: pkgrepo2deb-1.16 found ===> Done bootstrap-depends for py310-pal-python-0.9.14os1 ===> Installing full dependencies for py310-pal-python-0.9.14os1 => Dependency digest-20080510 already installed => Installing /opt/robotpkg/var/lib/robotpkg/packages/bsd/Ubuntu-22.04-x86_64/All/py310-catkin-pkg-1.0.0.tgz => Dependency tnftp-20151004~ssl already installed ===> Checking alternatives for py310-pal-python-0.9.14os1 => Use python-3.10: python>=2.5 provided by python310>=3.10<3.11 ===> Checking dependencies for py310-pal-python-0.9.14os1 => Required system package py310-pyparsing: py310-pyparsing found => Required system package py310-setuptools: py310-setuptools found => Required system package python310>=3.10<3.11: python310-3.10.12 found => Required robotpkg package py310-catkin-pkg>=0.2: py310-catkin-pkg-1.0.0 found ===> Done depends for py310-pal-python-0.9.14os1 ===> Extracting for py310-pal-python-0.9.14os1 => SHA1 checksums OK => RMD160 checksums OK ===> Configuring for py310-pal-python-0.9.14os1 ===> Building for py310-pal-python-0.9.14os1 /local/robotpkg/var/tmp/robotpkg/wip/py-pal/work/pal_python-0.9.14os1/setup.py:3: DeprecationWarning: The distutils package is deprecated and slated for removal in Python 3.12. Use setuptools or check PEP 632 for potential alternatives from distutils.core import setup warning: build_py: byte-compiling is disabled, skipping. ===> Installing for py310-pal-python-0.9.14os1 /local/robotpkg/var/tmp/robotpkg/wip/py-pal/work/pal_python-0.9.14os1/setup.py:3: DeprecationWarning: The distutils package is deprecated and slated for removal in Python 3.12. Use setuptools or check PEP 632 for potential alternatives from distutils.core import setup usage: setup.py [global_opts] cmd1 [cmd1_opts] [cmd2 [cmd2_opts] ...] or: setup.py --help [cmd1 cmd2 ...] or: setup.py --help-commands or: setup.py cmd --help error: option --single-version-externally-managed not recognized An unexpected error occured. The last 10 log lines are shown below. | Running set -e; cd /local/robotpkg/var/tmp/robotpkg/wip/py-pal/work/pal_python-0.9.14os1 && cd '/local/robotpkg/var/tmp/robotpkg/wip/py-pal/work/pal_python-0.9.14os1' && | /usr/bin/python3.10 setup.py install --prefix=/opt/openrobots --install-lib=/opt/openrobots/lib/python3.10/site-packages --install-script=/opt/openrobots/bin --install-data=/opt/openrobots --no-compile --single-version-externally-managed --root=/ | /local/robotpkg/var/tmp/robotpkg/wip/py-pal/work/pal_python-0.9.14os1/setup.py:3: DeprecationWarning: The distutils package is deprecated and slated for removal in Python 3.12. Use setuptools or check PEP 632 for potential alternatives | from distutils.core import setup | usage: setup.py [global_opts] cmd1 [cmd1_opts] [cmd2 [cmd2_opts] ...] | or: setup.py --help [cmd1 cmd2 ...] | or: setup.py --help-commands | or: setup.py cmd --help | | error: option --single-version-externally-managed not recognized For details or bug reports, check the complete log file in: /local/robotpkg/var/tmp/robotpkg/wip/py-pal/work/install.log make[4]: *** [../../mk/sysdep/py-setuptools.mk:54: do-install-setuptools(/local/robotpkg/var/tmp/robotpkg/wip/py-pal/work/pal_python-0.9.14os1)] Error 1 => Compiling python files File lib/python3.10/site-packages/pal_python/__init__.py could not be found File lib/python3.10/site-packages/pal_python/pal_common.py could not be found File lib/python3.10/site-packages/pal_python/pal_diagnostics.py could not be found File lib/python3.10/site-packages/pal_python/pal_environ.py could not be found File lib/python3.10/site-packages/pal_python/pal_hci.py could not be found File lib/python3.10/site-packages/pal_python/pal_launch.py could not be found File lib/python3.10/site-packages/pal_python/pal_path.py could not be found File lib/python3.10/site-packages/pal_python/pal_publishers.py could not be found File lib/python3.10/site-packages/pal_python/pal_rpc.py could not be found File lib/python3.10/site-packages/pal_python/pal_test_utils.py could not be found File lib/python3.10/site-packages/pal_python/pal_thread.py could not be found File lib/python3.10/site-packages/pal_python/ros_image_utils.py could not be found File lib/python3.10/site-packages/pal_python/shell_cmd.py could not be found => Undoing failed installation ERROR: ====================================================================== ERROR: Installation of py310-pal-python-0.9.14os1 failed. ERROR: ERROR: Check /local/robotpkg/var/tmp/robotpkg/wip/py-pal/work/install.log for details ERROR: ====================================================================== make[3]: *** [/local/robotpkg/var/lib/robotpkg/mk/install/install.mk:263: install-failed] Error 2 make[2]: *** [/local/robotpkg/var/lib/robotpkg/mk/pkg/package.mk:42: pkg-check-installed] Error 2 => Marking py310-pal-python-0.9.14os1 as broken ERROR: make: *** [package] Error 2 ===> Deinstalling for py310-pal-python Removed digest-20080510 Removed py310-catkin-pkg-1.0.0 Removed tnftp-20151004~ssl