robotpkg/wip/py-pal bulk build results

Log for py312-pal-python-0.9.14os1 on Rocky-10-x86_64: bulk.log (Back)

=> Checking for clear installation ===> Installing bootstrap dependencies for py312-pal-python-0.9.14os1 => Installing /opt/robotpkg/var/lib/robotpkg/packages/bsd/Rocky-10-x86_64/All/digest-20080510.tgz => Installing /opt/robotpkg/var/lib/robotpkg/packages/bsd/Rocky-10-x86_64/All/tnftp-20151004~ssl.tgz ===> Checking bootstrap dependencies for py312-pal-python-0.9.14os1 => Required robotpkg package digest>=20080510: digest-20080510 found => Required robotpkg package tnftp>=20091122: tnftp-20151004~ssl found => Required system package gzip: gzip-1.13 found => Required system package pax and tar archivers: pax found => Required system package pkg_install>=20110805.12: pkg_install-20211115.4 found ===> Done bootstrap-depends for py312-pal-python-0.9.14os1 ===> Installing full dependencies for py312-pal-python-0.9.14os1 => Dependency digest-20080510 already installed => Installing /opt/robotpkg/var/lib/robotpkg/packages/bsd/Rocky-10-x86_64/All/py312-catkin-pkg-1.0.0.tgz => Dependency tnftp-20151004~ssl already installed ===> Checking alternatives for py312-pal-python-0.9.14os1 => Use python-3.12: python>=2.5 provided by python312>=3.12<3.13 ===> Checking dependencies for py312-pal-python-0.9.14os1 => Required system package py312-pyparsing: py312-pyparsing found => Required system package py312-setuptools: py312-setuptools found => Required system package python312>=3.12<3.13: python312-3.12.14 found => Required robotpkg package py312-catkin-pkg>=0.2: py312-catkin-pkg-1.0.0 found WARNING: Using py312-catkin-pkg-1.0.0 in /opt/openrobots WARNING: The following packages may interfere with the build because they WARNING: are located in paths used by other dependencies: WARNING: py-catkin-pkg-1.1.1 in /usr ===> Done depends for py312-pal-python-0.9.14os1 ===> Extracting for py312-pal-python-0.9.14os1 => SHA1 checksums OK => RMD160 checksums OK ===> Configuring for py312-pal-python-0.9.14os1 ===> Building for py312-pal-python-0.9.14os1 warning: build_py: byte-compiling is disabled, skipping. ===> Installing for py312-pal-python-0.9.14os1 /usr/lib/python3.12/site-packages/setuptools/_distutils/cmd.py:66: SetuptoolsDeprecationWarning: setup.py install is deprecated. !! ******************************************************************************** Please avoid running ``setup.py`` directly. Instead, use pypa/build, pypa/installer or other standards-based tools. See https://blog.ganssle.io/articles/2021/10/setup-py-deprecated.html for details. ******************************************************************************** !! self.initialize_options() warning: build_py: byte-compiling is disabled, skipping. warning: install_lib: byte-compiling is disabled, skipping. => Compiling python files File "/opt/openrobots/lib/python3.12/site-packages/pal_python/pal_common.py", line 112 except Exception, e: ^^^^^^^^^^^^ SyntaxError: multiple exception types must be parenthesized File "/opt/openrobots/lib/python3.12/site-packages/pal_python/pal_launch.py", line 145 except LaunchError, e: ^^^^^^^^^^^^^^ SyntaxError: multiple exception types must be parenthesized File "/opt/openrobots/lib/python3.12/site-packages/pal_python/pal_publishers.py", line 149 except Exception, e: ^^^^^^^^^^^^ SyntaxError: multiple exception types must be parenthesized File "/opt/openrobots/lib/python3.12/site-packages/pal_python/pal_common.py", line 112 except Exception, e: ^^^^^^^^^^^^ SyntaxError: multiple exception types must be parenthesized File "/opt/openrobots/lib/python3.12/site-packages/pal_python/pal_launch.py", line 145 except LaunchError, e: ^^^^^^^^^^^^^^ SyntaxError: multiple exception types must be parenthesized File "/opt/openrobots/lib/python3.12/site-packages/pal_python/pal_publishers.py", line 149 except Exception, e: ^^^^^^^^^^^^ SyntaxError: multiple exception types must be parenthesized robotpkg_create: Warning - directory `/opt/openrobots/lib/python3.12/site-packages/pal_python-0.9.14-py3.12.egg-info' in PLIST robotpkg_create: can't stat `/opt/openrobots/lib/python3.12/site-packages/pal_python/__pycache__/pal_common.cpython-312.opt-1.pyc' robotpkg_create: can't stat `/opt/openrobots/lib/python3.12/site-packages/pal_python/__pycache__/pal_common.cpython-312.pyc' robotpkg_create: can't stat `/opt/openrobots/lib/python3.12/site-packages/pal_python/__pycache__/pal_launch.cpython-312.opt-1.pyc' robotpkg_create: can't stat `/opt/openrobots/lib/python3.12/site-packages/pal_python/__pycache__/pal_launch.cpython-312.pyc' robotpkg_create: can't stat `/opt/openrobots/lib/python3.12/site-packages/pal_python/__pycache__/pal_publishers.cpython-312.opt-1.pyc' robotpkg_create: can't stat `/opt/openrobots/lib/python3.12/site-packages/pal_python/__pycache__/pal_publishers.cpython-312.pyc' => Registering installation for py312-pal-python-0.9.14os1 robotpkg_admin: py312-pal-python-0.9.14os1: File `/opt/openrobots/lib/python3.12/site-packages/pal_python-0.9.14-py3.12.egg-info' is in +CONTENTS but not on filesystem! robotpkg_admin: py312-pal-python-0.9.14os1: File `/opt/openrobots/lib/python3.12/site-packages/pal_python/__pycache__/pal_common.cpython-312.opt-1.pyc' is in +CONTENTS but not on filesystem! robotpkg_admin: py312-pal-python-0.9.14os1: File `/opt/openrobots/lib/python3.12/site-packages/pal_python/__pycache__/pal_common.cpython-312.pyc' is in +CONTENTS but not on filesystem! robotpkg_admin: py312-pal-python-0.9.14os1: File `/opt/openrobots/lib/python3.12/site-packages/pal_python/__pycache__/pal_launch.cpython-312.opt-1.pyc' is in +CONTENTS but not on filesystem! robotpkg_admin: py312-pal-python-0.9.14os1: File `/opt/openrobots/lib/python3.12/site-packages/pal_python/__pycache__/pal_launch.cpython-312.pyc' is in +CONTENTS but not on filesystem! robotpkg_admin: py312-pal-python-0.9.14os1: File `/opt/openrobots/lib/python3.12/site-packages/pal_python/__pycache__/pal_publishers.cpython-312.opt-1.pyc' is in +CONTENTS but not on filesystem! robotpkg_admin: py312-pal-python-0.9.14os1: File `/opt/openrobots/lib/python3.12/site-packages/pal_python/__pycache__/pal_publishers.cpython-312.pyc' is in +CONTENTS but not on filesystem! Added py312-catkin-pkg-1.0.0 to the requirements of py312-pal-python-0.9.14os1 ===> Done install for py312-pal-python-0.9.14os1 ===> Building binary package for py312-pal-python-0.9.14os1 robotpkg_create: Warning - directory `/opt/openrobots/lib/python3.12/site-packages/pal_python-0.9.14-py3.12.egg-info' in PLIST robotpkg_create: can't stat `/opt/openrobots/lib/python3.12/site-packages/pal_python/__pycache__/pal_common.cpython-312.opt-1.pyc' robotpkg_create: can't stat `/opt/openrobots/lib/python3.12/site-packages/pal_python/__pycache__/pal_common.cpython-312.pyc' robotpkg_create: can't stat `/opt/openrobots/lib/python3.12/site-packages/pal_python/__pycache__/pal_launch.cpython-312.opt-1.pyc' robotpkg_create: can't stat `/opt/openrobots/lib/python3.12/site-packages/pal_python/__pycache__/pal_launch.cpython-312.pyc' robotpkg_create: can't stat `/opt/openrobots/lib/python3.12/site-packages/pal_python/__pycache__/pal_publishers.cpython-312.opt-1.pyc' robotpkg_create: can't stat `/opt/openrobots/lib/python3.12/site-packages/pal_python/__pycache__/pal_publishers.cpython-312.pyc' robotpkg_create: lstat failed for file lib/python3.12/site-packages/pal_python/__pycache__/pal_common.cpython-312.opt-1.pyc: No such file or directory Creating package /opt/robotpkg/var/lib/robotpkg/wip/packages/bsd/Rocky-10-x86_64/All/py312-pal-python-0.9.14os1 make[3]: *** [/local/robotpkg/var/lib/robotpkg/mk/pkg/package.mk:74: pkg-tarup] Error 2 => Unlinking package in /opt/robotpkg/var/lib/robotpkg/wip/packages/bsd/Rocky-10-x86_64/All => Unlinking package in /opt/robotpkg/var/lib/robotpkg/wip/packages/bsd/Rocky-10-x86_64/pub => Unlinking package in /opt/robotpkg/var/lib/robotpkg/wip/packages/bsd/Rocky-10-x86_64/jrl make[2]: *** [/local/robotpkg/var/lib/robotpkg/mk/package/package.mk:147: package-failed] Error 2 => Marking py312-pal-python-0.9.14os1 as broken ERROR: make: *** [package] Error 2 ===> Deinstalling for py312-pal-python Removing dependency py312-catkin-pkg-1.0.0 Removing dependency robotpkg_delete: attempting to delete directory `/opt/openrobots/lib/python3.12/site-packages/pal_python-0.9.14-py3.12.egg-info' as a file this packing list is incorrect - ignoring delete request robotpkg_delete: Couldn't remove /opt/openrobots/lib/python3.12/site-packages/pal_python/__pycache__/pal_common.cpython-312.opt-1.pyc: No such file or directory robotpkg_delete: Couldn't remove /opt/openrobots/lib/python3.12/site-packages/pal_python/__pycache__/pal_common.cpython-312.pyc: No such file or directory robotpkg_delete: Couldn't remove /opt/openrobots/lib/python3.12/site-packages/pal_python/__pycache__/pal_launch.cpython-312.opt-1.pyc: No such file or directory robotpkg_delete: Couldn't remove /opt/openrobots/lib/python3.12/site-packages/pal_python/__pycache__/pal_launch.cpython-312.pyc: No such file or directory robotpkg_delete: Couldn't remove /opt/openrobots/lib/python3.12/site-packages/pal_python/__pycache__/pal_publishers.cpython-312.opt-1.pyc: No such file or directory robotpkg_delete: Couldn't remove /opt/openrobots/lib/python3.12/site-packages/pal_python/__pycache__/pal_publishers.cpython-312.pyc: No such file or directory Removed py312-pal-python-0.9.14os1 Removed digest-20080510 Removed tnftp-20151004~ssl