robotpkg/wip/ros-image-pipeline bulk build results

Log for ros-image-pipeline-1.14.0 on NetBSD-11-x86_64: bulk.log (Back)

=> Checking for clear installation ===> Installing bootstrap dependencies for ros-image-pipeline-1.14.0 => Installing /opt/robotpkg/var/lib/robotpkg/packages/bsd/NetBSD-11-x86_64/All/digest-20080510.tgz => Installing /opt/robotpkg/var/lib/robotpkg/packages/bsd/NetBSD-11-x86_64/All/tnftp-20151004~ssl.tgz ===> Checking bootstrap dependencies for ros-image-pipeline-1.14.0 => Required robotpkg package digest>=20080510: digest-20080510 found => Required robotpkg package tnftp>=20130505~ssl: tnftp-20151004~ssl found => Required system package gzip: gzip-20260107 found => Required system package pax and tar archivers: pax found => Required system package pkg_install>=20110805.12: pkg_install-20211115.4 found ===> Done bootstrap-depends for ros-image-pipeline-1.14.0 ===> Installing full dependencies for ros-image-pipeline-1.14.0 => Dependency digest-20080510 already installed => Installing /opt/robotpkg/var/lib/robotpkg/packages/bsd/NetBSD-11-x86_64/All/py313-catkin-pkg-1.0.0.tgz => Installing /opt/robotpkg/var/lib/robotpkg/packages/bsd/NetBSD-11-x86_64/All/py313-ros-catkin-0.8.12.tgz To use ros, the following environment variables must contain those values: ROS_MASTER_URI http://localhost:11311 ROS_PACKAGE_PATH /opt/openrobots/share PYTHONPATH /opt/openrobots/lib/python3.13/site-packages PATH /opt/openrobots/bin As an alternative to the above configuration, commands can be executed by using the `env.sh' wrapper. For instance, roscore can be started like so: /opt/openrobots/etc/ros/env.sh roscore In Bourne shell scripts, the following file can be sourced instead: /opt/openrobots/etc/ros/setup.sh => Installing /opt/robotpkg/var/lib/robotpkg/packages/bsd/NetBSD-11-x86_64/All/ros-cmake-modules-0.5.2.tgz => Installing /opt/robotpkg/var/lib/robotpkg/packages/bsd/NetBSD-11-x86_64/All/ros-dynamic-reconfigure-1.7.3.tgz => Installing /opt/robotpkg/var/lib/robotpkg/packages/bsd/NetBSD-11-x86_64/All/ros-geometry-1.13.2.tgz => Dependency ros-geometry2-0.7.10 already installed => Installing /opt/robotpkg/var/lib/robotpkg/packages/bsd/NetBSD-11-x86_64/All/ros-nodelet-core-1.11.2.tgz => Installing /opt/robotpkg/var/lib/robotpkg/packages/bsd/NetBSD-11-x86_64/All/ros-vision-opencv-1.16.2.tgz => Dependency tnftp-20151004~ssl already installed ===> Checking build options for ros-image-pipeline-1.14.0 => Building with no option. ===> Checking alternatives for ros-image-pipeline-1.14.0 => Use the GNU C++ compiler: c++-compiler provided by g++>=3 => Use the GNU C compiler: c-compiler provided by gcc>=3 => Use python-3.13: python>=2.5 provided by python313>=3.13<3.14 ===> Checking dependencies for ros-image-pipeline-1.14.0 => Required system package cmake>=2.8.3: cmake-4.3.3 found => Required system package eigen3>=3.3: eigen3-3.4.0 found => Required system package g++>=3: g++-12.5.0 found => Required system package gcc>=3: gcc-12.5.0 found => Required system package gdk-pixbuf2>=2<3: gdk-pixbuf2-2.44.6 found => Required system package gtk>=2.8.17<3: gtk-2.24.33 found => Required system package libstdc++: libstdc++ found => Required system package pkg-config>=0.22: pkg-config-2.5.1 found => Required system package py313-empy>=3: py313-empy-3.3.4 found => Required system package py313-pyparsing: py313-pyparsing found => Required system package python313>=3.13<3.14: python313-3.13.14 found => Required system package shared-mime-info: shared-mime-info-2.4 found => Required robotpkg package py313-catkin-pkg>=0.2: py313-catkin-pkg-1.0.0 found => Required robotpkg package py313-ros-catkin>=0.7: py313-ros-catkin-0.8.12 found => Required robotpkg package ros-cmake-modules>=0.3: ros-cmake-modules-0.5.2 found => Required robotpkg package ros-dynamic-reconfigure>=1.5.32: ros-dynamic-reconfigure-1.7.3 found => Required robotpkg package ros-geometry>=1.11: ros-geometry-1.13.2 found => Required robotpkg package ros-geometry2>=0.5: ros-geometry2-0.7.10 found => Required robotpkg package ros-nodelet-core>=1.9: ros-nodelet-core-1.11.2 found => Required robotpkg package ros-vision-opencv>=1.12: ros-vision-opencv-1.16.2 found ===> Done depends for ros-image-pipeline-1.14.0 ===> Extracting for ros-image-pipeline-1.14.0 => SHA1 checksums OK => RMD160 checksums OK x image_pipeline-1.14.0/ x image_pipeline-1.14.0/.circleci/ x image_pipeline-1.14.0/.circleci/config.yml x image_pipeline-1.14.0/.gitignore x image_pipeline-1.14.0/README.md x image_pipeline-1.14.0/camera_calibration/ x image_pipeline-1.14.0/camera_calibration/CHANGELOG.rst x image_pipeline-1.14.0/camera_calibration/CMakeLists.txt x image_pipeline-1.14.0/camera_calibration/button.jpg x image_pipeline-1.14.0/camera_calibration/doc/ x image_pipeline-1.14.0/camera_calibration/doc/conf.py x image_pipeline-1.14.0/camera_calibration/doc/index.rst x image_pipeline-1.14.0/camera_calibration/mainpage.dox x image_pipeline-1.14.0/camera_calibration/nodes/ x image_pipeline-1.14.0/camera_calibration/nodes/cameracalibrator.py x image_pipeline-1.14.0/camera_calibration/nodes/cameracheck.py x image_pipeline-1.14.0/camera_calibration/package.xml x image_pipeline-1.14.0/camera_calibration/rosdoc.yaml x image_pipeline-1.14.0/camera_calibration/scripts/ x image_pipeline-1.14.0/camera_calibration/scripts/tarfile_calibration.py x image_pipeline-1.14.0/camera_calibration/setup.py x image_pipeline-1.14.0/camera_calibration/src/ x image_pipeline-1.14.0/camera_calibration/src/camera_calibration/ x image_pipeline-1.14.0/camera_calibration/src/camera_calibration/__init__.py x image_pipeline-1.14.0/camera_calibration/src/camera_calibration/calibrator.py x image_pipeline-1.14.0/camera_calibration/src/camera_calibration/camera_calibrator.py x image_pipeline-1.14.0/camera_calibration/src/camera_calibration/camera_checker.py x image_pipeline-1.14.0/camera_calibration/test/ x image_pipeline-1.14.0/camera_calibration/test/directed.py x image_pipeline-1.14.0/camera_calibration/test/multiple_boards.py x image_pipeline-1.14.0/depth_image_proc/ x image_pipeline-1.14.0/depth_image_proc/CHANGELOG.rst x image_pipeline-1.14.0/depth_image_proc/CMakeLists.txt x image_pipeline-1.14.0/depth_image_proc/include/ x image_pipeline-1.14.0/depth_image_proc/include/depth_image_proc/ x image_pipeline-1.14.0/depth_image_proc/include/depth_image_proc/depth_conversions.h x image_pipeline-1.14.0/depth_image_proc/include/depth_image_proc/depth_traits.h x image_pipeline-1.14.0/depth_image_proc/mainpage.dox x image_pipeline-1.14.0/depth_image_proc/nodelet_plugins.xml x image_pipeline-1.14.0/depth_image_proc/package.xml x image_pipeline-1.14.0/depth_image_proc/src/ x image_pipeline-1.14.0/depth_image_proc/src/nodelets/ x image_pipeline-1.14.0/depth_image_proc/src/nodelets/convert_metric.cpp x image_pipeline-1.14.0/depth_image_proc/src/nodelets/crop_foremost.cpp x image_pipeline-1.14.0/depth_image_proc/src/nodelets/disparity.cpp x image_pipeline-1.14.0/depth_image_proc/src/nodelets/point_cloud_xyz.cpp x image_pipeline-1.14.0/depth_image_proc/src/nodelets/point_cloud_xyz_radial.cpp x image_pipeline-1.14.0/depth_image_proc/src/nodelets/point_cloud_xyzi.cpp x image_pipeline-1.14.0/depth_image_proc/src/nodelets/point_cloud_xyzi_radial.cpp x image_pipeline-1.14.0/depth_image_proc/src/nodelets/point_cloud_xyzrgb.cpp x image_pipeline-1.14.0/depth_image_proc/src/nodelets/register.cpp x image_pipeline-1.14.0/image_pipeline/ x image_pipeline-1.14.0/image_pipeline/CHANGELOG.rst x image_pipeline-1.14.0/image_pipeline/CMakeLists.txt x image_pipeline-1.14.0/image_pipeline/package.xml x image_pipeline-1.14.0/image_proc/ x image_pipeline-1.14.0/image_proc/CHANGELOG.rst x image_pipeline-1.14.0/image_proc/CMakeLists.txt x image_pipeline-1.14.0/image_proc/cfg/ x image_pipeline-1.14.0/image_proc/cfg/CropDecimate.cfg x image_pipeline-1.14.0/image_proc/cfg/Debayer.cfg x image_pipeline-1.14.0/image_proc/cfg/Rectify.cfg x image_pipeline-1.14.0/image_proc/cfg/Resize.cfg x image_pipeline-1.14.0/image_proc/include/ x image_pipeline-1.14.0/image_proc/include/image_proc/ x image_pipeline-1.14.0/image_proc/include/image_proc/advertisement_checker.h x image_pipeline-1.14.0/image_proc/include/image_proc/processor.h x image_pipeline-1.14.0/image_proc/launch/ x image_pipeline-1.14.0/image_proc/launch/image_proc.launch x image_pipeline-1.14.0/image_proc/mainpage.dox x image_pipeline-1.14.0/image_proc/nodelet_plugins.xml x image_pipeline-1.14.0/image_proc/package.xml x image_pipeline-1.14.0/image_proc/src/ x image_pipeline-1.14.0/image_proc/src/libimage_proc/ x image_pipeline-1.14.0/image_proc/src/libimage_proc/advertisement_checker.cpp x image_pipeline-1.14.0/image_proc/src/libimage_proc/processor.cpp x image_pipeline-1.14.0/image_proc/src/nodelets/ x image_pipeline-1.14.0/image_proc/src/nodelets/crop_decimate.cpp x image_pipeline-1.14.0/image_proc/src/nodelets/crop_non_zero.cpp x image_pipeline-1.14.0/image_proc/src/nodelets/debayer.cpp x image_pipeline-1.14.0/image_proc/src/nodelets/edge_aware.cpp x image_pipeline-1.14.0/image_proc/src/nodelets/edge_aware.h x image_pipeline-1.14.0/image_proc/src/nodelets/rectify.cpp x image_pipeline-1.14.0/image_proc/src/nodelets/resize.cpp x image_pipeline-1.14.0/image_proc/src/nodes/ x image_pipeline-1.14.0/image_proc/src/nodes/image_proc.cpp x image_pipeline-1.14.0/image_proc/test/ x image_pipeline-1.14.0/image_proc/test/CMakeLists.txt x image_pipeline-1.14.0/image_proc/test/rostest.cpp x image_pipeline-1.14.0/image_proc/test/test_bayer.xml x image_pipeline-1.14.0/image_proc/test/test_rectify.cpp x image_pipeline-1.14.0/image_proc/test/test_rectify.xml x image_pipeline-1.14.0/image_publisher/ x image_pipeline-1.14.0/image_publisher/CHANGELOG.rst x image_pipeline-1.14.0/image_publisher/CMakeLists.txt x image_pipeline-1.14.0/image_publisher/cfg/ x image_pipeline-1.14.0/image_publisher/cfg/ImagePublisher.cfg x image_pipeline-1.14.0/image_publisher/nodelet_plugins.xml x image_pipeline-1.14.0/image_publisher/package.xml x image_pipeline-1.14.0/image_publisher/src/ x image_pipeline-1.14.0/image_publisher/src/node/ x image_pipeline-1.14.0/image_publisher/src/node/image_publisher.cpp x image_pipeline-1.14.0/image_publisher/src/nodelet/ x image_pipeline-1.14.0/image_publisher/src/nodelet/image_publisher_nodelet.cpp x image_pipeline-1.14.0/image_rotate/ x image_pipeline-1.14.0/image_rotate/CHANGELOG.rst x image_pipeline-1.14.0/image_rotate/CMakeLists.txt x image_pipeline-1.14.0/image_rotate/cfg/ x image_pipeline-1.14.0/image_rotate/cfg/ImageRotate.cfg x image_pipeline-1.14.0/image_rotate/mainpage.dox x image_pipeline-1.14.0/image_rotate/nodelet_plugins.xml x image_pipeline-1.14.0/image_rotate/package.xml x image_pipeline-1.14.0/image_rotate/src/ x image_pipeline-1.14.0/image_rotate/src/node/ x image_pipeline-1.14.0/image_rotate/src/node/image_rotate.cpp x image_pipeline-1.14.0/image_rotate/src/nodelet/ x image_pipeline-1.14.0/image_rotate/src/nodelet/image_rotate_nodelet.cpp x image_pipeline-1.14.0/image_view/ x image_pipeline-1.14.0/image_view/CHANGELOG.rst x image_pipeline-1.14.0/image_view/CMakeLists.txt x image_pipeline-1.14.0/image_view/cfg/ x image_pipeline-1.14.0/image_view/cfg/ImageView.cfg x image_pipeline-1.14.0/image_view/mainpage.dox x image_pipeline-1.14.0/image_view/nodelet_plugins.xml x image_pipeline-1.14.0/image_view/package.xml x image_pipeline-1.14.0/image_view/rosdoc.yaml x image_pipeline-1.14.0/image_view/scripts/ x image_pipeline-1.14.0/image_view/scripts/extract_images_sync x image_pipeline-1.14.0/image_view/src/ x image_pipeline-1.14.0/image_view/src/nodelets/ x image_pipeline-1.14.0/image_view/src/nodelets/disparity_nodelet.cpp x image_pipeline-1.14.0/image_view/src/nodelets/image_nodelet.cpp x image_pipeline-1.14.0/image_view/src/nodelets/window_thread.cpp x image_pipeline-1.14.0/image_view/src/nodelets/window_thread.h x image_pipeline-1.14.0/image_view/src/nodes/ x image_pipeline-1.14.0/image_view/src/nodes/disparity_view.cpp x image_pipeline-1.14.0/image_view/src/nodes/extract_images.cpp x image_pipeline-1.14.0/image_view/src/nodes/image_saver.cpp x image_pipeline-1.14.0/image_view/src/nodes/image_view.cpp x image_pipeline-1.14.0/image_view/src/nodes/stereo_view.cpp x image_pipeline-1.14.0/image_view/src/nodes/video_recorder.cpp x image_pipeline-1.14.0/stereo_image_proc/ x image_pipeline-1.14.0/stereo_image_proc/CHANGELOG.rst x image_pipeline-1.14.0/stereo_image_proc/CMakeLists.txt x image_pipeline-1.14.0/stereo_image_proc/cfg/ x image_pipeline-1.14.0/stereo_image_proc/cfg/Disparity.cfg x image_pipeline-1.14.0/stereo_image_proc/doc/ x image_pipeline-1.14.0/stereo_image_proc/doc/mainpage.dox x image_pipeline-1.14.0/stereo_image_proc/doc/stereo_frames.svg x image_pipeline-1.14.0/stereo_image_proc/include/ x image_pipeline-1.14.0/stereo_image_proc/include/stereo_image_proc/ x image_pipeline-1.14.0/stereo_image_proc/include/stereo_image_proc/processor.h x image_pipeline-1.14.0/stereo_image_proc/launch/ x image_pipeline-1.14.0/stereo_image_proc/launch/stereo_image_proc.launch x image_pipeline-1.14.0/stereo_image_proc/nodelet_plugins.xml x image_pipeline-1.14.0/stereo_image_proc/package.xml x image_pipeline-1.14.0/stereo_image_proc/rosdoc.yaml x image_pipeline-1.14.0/stereo_image_proc/src/ x image_pipeline-1.14.0/stereo_image_proc/src/libstereo_image_proc/ x image_pipeline-1.14.0/stereo_image_proc/src/libstereo_image_proc/processor.cpp x image_pipeline-1.14.0/stereo_image_proc/src/nodelets/ x image_pipeline-1.14.0/stereo_image_proc/src/nodelets/disparity.cpp x image_pipeline-1.14.0/stereo_image_proc/src/nodelets/point_cloud2.cpp x image_pipeline-1.14.0/stereo_image_proc/src/nodes/ x image_pipeline-1.14.0/stereo_image_proc/src/nodes/stereo_image_proc.cpp x image_pipeline-1.14.0/wiki_files/ x image_pipeline-1.14.0/wiki_files/dcam-driver.svg x image_pipeline-1.14.0/wiki_files/image_proc.svg x image_pipeline-1.14.0/wiki_files/image_proc_dual.svg x image_pipeline-1.14.0/wiki_files/rospack_nosubdirs x image_pipeline-1.14.0/wiki_files/stereo_image_proc.svg x image_pipeline-1.14.0/wiki_files/stereo_image_proc_stereo.svg x image_pipeline-1.14.0/wiki_files/stereocam-driver.svg x image_pipeline-1.14.0/wiki_files/stoc.svg ===> Configuring for ros-image-pipeline-1.14.0 => Replacing python interpreter path CMake Deprecation Warning at CMakeLists.txt:4 (cmake_minimum_required): Compatibility with CMake < 3.10 will be removed from a future version of CMake. Update the VERSION argument <min> value. Or, use the <min>...<max> syntax to tell CMake that the project requires at least <min> but has been updated to work with policies introduced by <max> or earlier. CMake Warning (dev) at /opt/openrobots/share/catkin/cmake/python.cmake:4 (find_package): Policy CMP0148 is not set: The FindPythonInterp and FindPythonLibs modules are removed. Run "cmake --help-policy CMP0148" for policy details. Use the cmake_policy command to set the policy and suppress this warning. Call Stack (most recent call first): /opt/openrobots/share/catkin/cmake/all.cmake:164 (include) /opt/openrobots/share/catkin/cmake/catkinConfig.cmake:20 (include) CMakeLists.txt:58 (find_package) This warning is for project developers. Use -Wno-dev to suppress it. CMake Deprecation Warning at image_pipeline/CMakeLists.txt:1 (cmake_minimum_required): Compatibility with CMake < 3.10 will be removed from a future version of CMake. Update the VERSION argument <min> value. Or, use the <min>...<max> syntax to tell CMake that the project requires at least <min> but has been updated to work with policies introduced by <max> or earlier. CMake Deprecation Warning at camera_calibration/CMakeLists.txt:1 (cmake_minimum_required): Compatibility with CMake < 3.10 will be removed from a future version of CMake. Update the VERSION argument <min> value. Or, use the <min>...<max> syntax to tell CMake that the project requires at least <min> but has been updated to work with policies introduced by <max> or earlier. CMake Deprecation Warning at image_proc/CMakeLists.txt:1 (cmake_minimum_required): Compatibility with CMake < 3.10 will be removed from a future version of CMake. Update the VERSION argument <min> value. Or, use the <min>...<max> syntax to tell CMake that the project requires at least <min> but has been updated to work with policies introduced by <max> or earlier. CMake Warning (dev) at image_proc/CMakeLists.txt:8 (find_package): Policy CMP0167 is not set: The FindBoost module is removed. Run "cmake --help-policy CMP0167" for policy details. Use the cmake_policy command to set the policy and suppress this warning. This warning is for project developers. Use -Wno-dev to suppress it. CMake Warning (dev) at /opt/openrobots/share/dynamic_reconfigure/cmake/dynamic_reconfigure-macros.cmake:128 (find_package): Policy CMP0148 is not set: The FindPythonInterp and FindPythonLibs modules are removed. Run "cmake --help-policy CMP0148" for policy details. Use the cmake_policy command to set the policy and suppress this warning. Call Stack (most recent call first): /opt/openrobots/share/dynamic_reconfigure/cmake/dynamic_reconfigure-macros.cmake:89 (dynreconf_called) image_proc/CMakeLists.txt:15 (generate_dynamic_reconfigure_options) This warning is for project developers. Use -Wno-dev to suppress it. CMake Deprecation Warning at image_publisher/CMakeLists.txt:1 (cmake_minimum_required): Compatibility with CMake < 3.10 will be removed from a future version of CMake. Update the VERSION argument <min> value. Or, use the <min>...<max> syntax to tell CMake that the project requires at least <min> but has been updated to work with policies introduced by <max> or earlier. CMake Error at image_publisher/CMakeLists.txt:13 (find_package): Could not find a configuration file for package "OpenCV" that is compatible with requested version "3". The following configuration files were considered but not accepted: /usr/pkg/lib/cmake/opencv4/OpenCVConfig.cmake, version: 4.13.0 The version found is not compatible with the version requested. An unexpected error occured. The last 10 log lines are shown below. | with requested version "3". | | The following configuration files were considered but not accepted: | | /usr/pkg/lib/cmake/opencv4/OpenCVConfig.cmake, version: 4.13.0 | The version found is not compatible with the version requested. | | | | -- Configuring incomplete, errors occurred! For details or bug reports, check the complete log file in: /local/robotpkg/var/tmp/robotpkg/wip/ros-image-pipeline/work/configure.log gmake[3]: *** [/local/robotpkg/var/lib/robotpkg/mk/configure/cmake-configure.mk:101: do-configure-cmake(/local/robotpkg/var/tmp/robotpkg/wip/ros-image-pipeline/work/image_pipeline-1.14.0/build)] Error 1 gmake[2]: *** [/local/robotpkg/var/lib/robotpkg/mk/pkg/package.mk:42: pkg-check-installed] Error 2 => Marking ros-image-pipeline-1.14.0 as broken ERROR: /usr/pkg/bin/gmake: *** [package] Error 2 ===> Deinstalling for ros-image-pipeline Removed digest-20080510 Removing dependency py313-rosdep-0.26.0 Removing dependency py313-ros-catkin-0.8.12 Removing dependency ros-angles-1.9.13 Removing dependency ros-environment-1.3.2r1 Removing dependency ros-rospack-2.5.1r1 Removing dependency ros-roscpp-core-0.7.3r1 Removing dependency ros-genmsg-0.6.1 Removing dependency ros-ros-1.15.8r1 Removing dependency ros-console-1.14.4 Removing dependency ros-gennodejs-2.0.1 Removing dependency ros-genlisp-0.4.18 Removing dependency ros-geneus-3.0.0 Removing dependency ros-gencpp-0.7.2 Removing dependency ros-genpy-0.6.18 Removing dependency ros-message-runtime-0.4.13 Removing dependency ros-message-generation-0.4.1 Removing dependency ros-std-msgs-0.5.14 Removing dependency ros-common-msgs-1.13.1 Removing dependency ros-comm-msgs-1.11.4 Removing dependency ros-class-loader-0.5.2 Removing dependency ros-pluginlib-1.13.2 Removing dependency ros-comm-1.17.4 Removing dependency ros-image-common-1.12.0 Removing dependency ros-vision-opencv-1.16.2 Removing dependency ros-bond-core-1.8.6r1 Removing dependency ros-actionlib-1.14.0 Removing dependency ros-geometry2-0.7.10 Removing dependency ros-geometry-1.13.2 Removing dependency ros-dynamic-reconfigure-1.7.3 Removing dependency ros-nodelet-core-1.11.2 Removing dependency ros-cmake-modules-0.5.2 Removed py313-catkin-pkg-1.0.0 Removed tnftp-20151004~ssl