robotpkg/wip/ros-image-pipeline bulk build results

ros-image-pipeline-1.14.0 (category wip or summary)

Platform Status Date Time Log files
Start Total brokenbulkcbbhcbbhbycmakeconfigureextract
Debian-11-x86_64Broken2026/09/3020:57:0500:00:11
make: *** [package] Error 2
ViewViewViewView
Debian-12-x86_64Broken2026/09/3021:15:1600:00:13
make: *** [package] Error 2
ViewViewViewView
Debian-13-x86_64Broken2026/09/3021:35:5400:00:11
make: *** [package] Error 2
ViewViewViewView
Fedora-42-x86_64Broken2026/09/3021:32:1300:00:14
make: *** [package] Error 2
ViewViewViewView
Fedora-44-x86_64Broken2026/09/3020:55:5100:01:05
make: *** [package] Error 2
ViewViewViewView
NetBSD-11-x86_64Broken2026/09/3021:51:4800:00:18
/usr/pkg/bin/gmake: *** [package] Error 2
ViewViewViewView
Rocky-10-x86_64N/A2026/09/3021:03:0600:00:04ViewView
poco>=1
Rocky-8-x86_64N/A2026/09/3021:34:0600:00:04ViewView
poco>=1
Ubuntu-20.04-x86_64Broken2026/09/3020:55:4800:00:48
make: *** [package] Error 2
ViewViewViewView
Ubuntu-22.04-x86_64Broken2026/09/3021:34:0100:00:13
make: *** [package] Error 2
ViewViewViewView
Ubuntu-24.04-x86_64Broken2026/09/3021:13:3400:00:12
make: *** [package] Error 2
ViewViewViewView
Ubuntu-26.04-x86_64Broken2026/09/3021:09:3000:00:14
make: *** [package] Error 2
ViewViewViewView