robotpkg/wip/py-sot-dynamic-pinocchio-v3 bulk build results

py27-sot-dynamic-pinocchio-v3-3.6.5r2 (category wip or summary)

Platform Status Date Time Log files
Start Total bulkcbbhcbbhbysysdep
Debian-11-x86_64N/A2026/09/1803:18:1900:00:00ViewView
Debian-12-x86_64N/A2026/09/1807:35:3300:00:01ViewView
Debian-13-x86_64N/A2026/09/1805:03:1300:00:00ViewView
Fedora-42-x86_64N/A2026/09/1809:09:1800:00:01ViewView
Fedora-44-x86_64N/A2026/09/1808:13:3500:00:00ViewView
NetBSD-11-x86_64N/A2026/09/1812:20:5700:00:01ViewView
Rocky-10-x86_64N/A2026/09/1805:06:0700:00:00ViewView
Rocky-8-x86_64N/A2026/09/1802:05:3300:00:00ViewView
Ubuntu-20.04-x86_64Sysdep2026/09/3021:17:5400:00:10ViewView
boost-libs>=1.34.1
cmake>=3.22
py-sphinx>=1.1
py27-eigenpy-3.5.0
py27-numpy>=1
sot-dynamic-pinocchio-v3>=3.2.0<4.0.0
View
Ubuntu-22.04-x86_64Sysdep2026/09/3021:56:4700:00:17ViewView
boost-libs>=1.34.1
py-sphinx>=1.1
py27-eigenpy-3.5.0
py27-numpy>=1
View
Ubuntu-24.04-x86_64N/A2026/09/1807:08:5600:00:00ViewView
Ubuntu-26.04-x86_64N/A2026/09/1805:27:4900:00:00ViewView

py310-sot-dynamic-pinocchio-v3-3.6.5r2 (category wip or summary)

Platform Status Date Time Log files
Start Total brokenbuildbulkcbbhcmakeconfigureextract
Debian-11-x86_64N/A2026/09/1803:18:2000:00:00ViewView
Debian-12-x86_64N/A2026/09/1807:35:3400:00:00ViewView
Debian-13-x86_64N/A2026/09/1805:03:1300:00:01ViewView
Fedora-42-x86_64N/A2026/09/1809:09:1900:00:01ViewView
Fedora-44-x86_64N/A2026/09/1808:13:3600:00:00ViewView
NetBSD-11-x86_64N/A2026/09/1812:20:5800:00:01ViewView
Rocky-10-x86_64N/A2026/09/1805:06:0800:00:00ViewView
Rocky-8-x86_64N/A2026/09/1802:05:3300:00:01ViewView
Ubuntu-20.04-x86_64N/A2026/09/2204:46:4800:00:00ViewView
Ubuntu-22.04-x86_64Broken2026/09/3021:55:4300:01:04
make: *** [package] Error 2
ViewViewViewViewView
Ubuntu-24.04-x86_64N/A2026/09/1807:08:5700:00:00ViewView
Ubuntu-26.04-x86_64N/A2026/09/1805:27:4900:00:01ViewView

py311-sot-dynamic-pinocchio-v3-3.6.5r2 (category wip or summary)

Platform Status Date Time Log files
Start Total brokenbuildbulkcbbhcmakeconfigureextract
Debian-11-x86_64N/A2026/09/1803:18:2000:00:00ViewView
Debian-12-x86_64Broken2026/09/3021:40:1800:01:11
make: *** [package] Error 2
ViewViewViewViewView
Debian-13-x86_64N/A2026/09/1805:03:1400:00:00ViewView
Fedora-42-x86_64N/A2026/09/1809:09:2000:00:01ViewView
Fedora-44-x86_64N/A2026/09/1808:13:3700:00:00ViewView
NetBSD-11-x86_64N/A2026/09/1812:20:5900:00:01ViewView
Rocky-10-x86_64N/A2026/09/1805:06:0800:00:01ViewView
Rocky-8-x86_64N/A2026/09/1802:05:3400:00:00ViewView
Ubuntu-20.04-x86_64N/A2026/09/2204:46:4900:00:00ViewView
Ubuntu-22.04-x86_64N/A2026/09/1808:38:1800:00:01ViewView
Ubuntu-24.04-x86_64N/A2026/09/1807:08:5700:00:00ViewView
Ubuntu-26.04-x86_64N/A2026/09/1805:27:5000:00:00ViewView

py312-sot-dynamic-pinocchio-v3-3.6.5r2 (category wip or summary)

Platform Status Date Time Log files
Start Total brokenbrokenbybuildbulkcbbhcmakeconfigureextract
Debian-11-x86_64N/A2026/09/1803:18:2100:00:00ViewView
Debian-12-x86_64N/A2026/09/1807:35:3500:00:00ViewView
Debian-13-x86_64N/A2026/09/1805:03:1400:00:01ViewView
Fedora-42-x86_64N/A2026/09/1809:09:2100:00:01ViewView
Fedora-44-x86_64N/A2026/09/1808:13:3800:00:00ViewView
NetBSD-11-x86_64N/A2026/09/1812:21:0100:00:00ViewView
Rocky-10-x86_64Broken2026/09/3021:19:4000:00:08
Required robotpkg package py312-sot-core-v3>=4.11.7<5.0.0: BROKEN Required robotpkg package py312-sot-tools-v3>=2.0: BROKEN Required robotpkg package sot-dynamic-pinocchio-v3>=3.2.0<4.0.0: BROKEN
View
Rocky-8-x86_64N/A2026/09/1802:05:3500:00:00ViewView
Ubuntu-20.04-x86_64N/A2026/09/2204:46:5000:00:00ViewView
Ubuntu-22.04-x86_64N/A2026/09/1808:38:1900:00:00ViewView
Ubuntu-24.04-x86_64Broken2026/09/3021:44:0600:00:59
make: *** [package] Error 2
ViewViewViewViewView
Ubuntu-26.04-x86_64N/A2026/09/1805:27:5100:00:00ViewView

py313-sot-dynamic-pinocchio-v3-3.6.5r2 (category wip or summary)

Platform Status Date Time Log files
Start Total brokenbrokenbybulkcbbh
Debian-11-x86_64N/A2026/09/1803:18:2100:00:00ViewView
Debian-12-x86_64N/A2026/09/1807:35:3600:00:00ViewView
Debian-13-x86_64Broken2026/09/3021:53:2400:00:10
Required robotpkg package sot-dynamic-pinocchio-v3>=3.2.0<4.0.0: BROKEN
View
Fedora-42-x86_64Broken2026/09/3021:38:4700:00:09
Required robotpkg package sot-dynamic-pinocchio-v3>=3.2.0<4.0.0: BROKEN
View
Fedora-44-x86_64N/A2026/09/1808:13:3900:00:00ViewView
NetBSD-11-x86_64Broken2026/09/3022:00:2600:00:10
Required robotpkg package dynamic-graph-v3>=4.3.0: BROKEN Required robotpkg package py313-dynamic-graph-v3>=4.0.0: BROKEN Required robotpkg package py313-sot-core-v3>=4.11.7<5.0.0: BROKEN Required robotpkg package py313-sot-tools-v3>=2.0: BROKEN Required robotpkg package sot-dynamic-pinocchio-v3>=3.2.0<4.0.0: BROKEN
View
Rocky-10-x86_64N/A2026/09/1805:06:0900:00:00ViewView
Rocky-8-x86_64N/A2026/09/1802:05:3500:00:01ViewView
Ubuntu-20.04-x86_64N/A2026/09/2204:46:5000:00:01ViewView
Ubuntu-22.04-x86_64N/A2026/09/1808:38:2000:00:00ViewView
Ubuntu-24.04-x86_64N/A2026/09/1807:08:5800:00:00ViewView
Ubuntu-26.04-x86_64N/A2026/09/1805:27:5100:00:01ViewView

py314-sot-dynamic-pinocchio-v3-3.6.5r2 (category wip or summary)

Platform Status Date Time Log files
Start Total brokenbrokenbybulkcbbh
Debian-11-x86_64N/A2026/09/1803:18:2200:00:00ViewView
Debian-12-x86_64N/A2026/09/1807:35:3600:00:01ViewView
Debian-13-x86_64N/A2026/09/1805:03:1500:00:00ViewView
Fedora-42-x86_64N/A2026/09/1809:09:2200:00:01ViewView
Fedora-44-x86_64Broken2026/09/3021:13:4800:00:05
Required robotpkg package dynamic-graph-v3>=4.3.0: BROKEN Required robotpkg package py314-dynamic-graph-v3>=4.0.0: BROKEN Required robotpkg package py314-sot-core-v3>=4.11.7<5.0.0: BROKEN Required robotpkg package py314-sot-tools-v3>=2.0: BROKEN Required robotpkg package sot-dynamic-pinocchio-v3>=3.2.0<4.0.0: BROKEN
View
NetBSD-11-x86_64N/A2026/09/1812:21:0200:00:01ViewView
Rocky-10-x86_64N/A2026/09/1805:06:1000:00:00ViewView
Rocky-8-x86_64N/A2026/09/1802:05:3600:00:00ViewView
Ubuntu-20.04-x86_64N/A2026/09/2204:46:5100:00:01ViewView
Ubuntu-22.04-x86_64N/A2026/09/1808:38:2000:00:01ViewView
Ubuntu-24.04-x86_64N/A2026/09/1807:08:5800:00:01ViewView
Ubuntu-26.04-x86_64Broken2026/09/3021:18:5800:00:07
Required robotpkg package dynamic-graph-v3>=4.3.0: BROKEN Required robotpkg package py314-dynamic-graph-v3>=4.0.0: BROKEN Required robotpkg package py314-sot-core-v3>=4.11.7<5.0.0: BROKEN Required robotpkg package py314-sot-tools-v3>=2.0: BROKEN Required robotpkg package sot-dynamic-pinocchio-v3>=3.2.0<4.0.0: BROKEN
View

py36-sot-dynamic-pinocchio-v3-3.6.5r2 (category wip or summary)

Platform Status Date Time Log files
Start Total bulkcbbhcbbhby
Debian-11-x86_64N/A2026/09/1803:18:2200:00:00ViewView
Debian-12-x86_64N/A2026/09/1807:35:3700:00:00ViewView
Debian-13-x86_64N/A2026/09/1805:03:1500:00:01ViewView
Fedora-42-x86_64N/A2026/09/1809:09:2300:00:01ViewView
Fedora-44-x86_64N/A2026/09/1808:13:4000:00:00ViewView
NetBSD-11-x86_64N/A2026/09/1812:21:0300:00:01ViewView
Rocky-10-x86_64N/A2026/09/1805:06:1000:00:01ViewView
Rocky-8-x86_64N/A2026/09/3022:02:3200:00:08ViewView
pinocchio>=3
py36-pinocchio>=3.0.0
py36-sot-core-v3>=4.11.7<5.0.0
py36-sot-tools-v3>=2.0
sot-dynamic-pinocchio-v3>=3.2.0<4.0.0
Ubuntu-20.04-x86_64N/A2026/09/2204:46:5200:00:01ViewView
Ubuntu-22.04-x86_64N/A2026/09/1808:38:2100:00:00ViewView
Ubuntu-24.04-x86_64N/A2026/09/1807:08:5900:00:00ViewView
Ubuntu-26.04-x86_64N/A2026/09/1805:27:5200:00:00ViewView

py38-sot-dynamic-pinocchio-v3-3.6.5r2 (category wip or summary)

Platform Status Date Time Log files
Start Total bulkcbbhcbbhby
Debian-11-x86_64N/A2026/09/1803:18:2300:00:00ViewView
Debian-12-x86_64N/A2026/09/1807:35:3800:00:00ViewView
Debian-13-x86_64N/A2026/09/1805:03:1600:00:00ViewView
Fedora-42-x86_64N/A2026/09/1809:09:2400:00:01ViewView
Fedora-44-x86_64N/A2026/09/1808:13:4100:00:00ViewView
NetBSD-11-x86_64N/A2026/09/1812:21:0400:00:01ViewView
Rocky-10-x86_64N/A2026/09/1805:06:1100:00:00ViewView
Rocky-8-x86_64N/A2026/09/1802:05:3700:00:00ViewView
Ubuntu-20.04-x86_64N/A2026/09/3021:17:4300:00:11ViewView
cmake>=3.22
sot-dynamic-pinocchio-v3>=3.2.0<4.0.0
Ubuntu-22.04-x86_64N/A2026/09/1808:38:2200:00:00ViewView
Ubuntu-24.04-x86_64N/A2026/09/1807:09:0000:00:00ViewView
Ubuntu-26.04-x86_64N/A2026/09/1805:27:5300:00:00ViewView

py39-sot-dynamic-pinocchio-v3-3.6.5r2 (category wip or summary)

Platform Status Date Time Log files
Start Total bulkcbbhcbbhby
Debian-11-x86_64N/A2026/09/3020:58:4000:00:08ViewView
cmake>=3.22
Debian-12-x86_64N/A2026/09/1807:35:3800:00:01ViewView
Debian-13-x86_64N/A2026/09/1805:03:1700:00:00ViewView
Fedora-42-x86_64N/A2026/09/1809:09:2500:00:01ViewView
Fedora-44-x86_64N/A2026/09/1808:13:4200:00:00ViewView
NetBSD-11-x86_64N/A2026/09/1812:21:0600:00:00ViewView
Rocky-10-x86_64N/A2026/09/1805:06:1200:00:00ViewView
Rocky-8-x86_64N/A2026/09/1802:05:3700:00:01ViewView
Ubuntu-20.04-x86_64N/A2026/09/2204:46:5300:00:01ViewView
Ubuntu-22.04-x86_64N/A2026/09/1808:38:2300:00:00ViewView
Ubuntu-24.04-x86_64N/A2026/09/1807:09:0000:00:01ViewView
Ubuntu-26.04-x86_64N/A2026/09/1805:27:5300:00:01ViewView