robotpkg/wip/py-sl1m bulk build results

py27-sl1m-0.1.1 (category wip or summary)

Platform Status Date Time Log files
Start Total bulkcbbhcbbhby
Debian-11-x86_64N/A2026/09/1802:28:2900:00:01ViewView
Debian-12-x86_64N/A2026/09/1807:25:3700:00:00ViewView
Debian-13-x86_64N/A2026/09/1804:46:5600:00:01ViewView
Fedora-42-x86_64N/A2026/09/1808:54:2900:00:00ViewView
Fedora-44-x86_64N/A2026/09/1808:05:4700:00:00ViewView
NetBSD-11-x86_64N/A2026/09/1811:59:4400:00:00ViewView
Rocky-10-x86_64N/A2026/09/1805:01:0300:00:00ViewView
Rocky-8-x86_64N/A2026/09/1800:49:4400:00:00ViewView
Ubuntu-20.04-x86_64N/A2026/09/2218:02:4300:00:03ViewView
cmake>=3.22
py27-numpy>=1
Ubuntu-22.04-x86_64N/A2026/09/2217:58:4300:00:02ViewView
py27-cython>=0.20.0
py27-numpy>=1
Ubuntu-24.04-x86_64N/A2026/09/1806:34:2300:00:00ViewView
Ubuntu-26.04-x86_64N/A2026/09/1805:07:3700:00:00ViewView

py310-sl1m-0.1.1 (category wip or summary)

Platform Status Date Time Log files
Start Total brokenbuildbulkcbbhcmakeconfigureextractinstallplist
Debian-11-x86_64N/A2026/09/1802:28:3000:00:00ViewView
Debian-12-x86_64N/A2026/09/1807:25:3700:00:01ViewView
Debian-13-x86_64N/A2026/09/1804:46:5700:00:00ViewView
Fedora-42-x86_64N/A2026/09/1808:54:3000:00:00ViewView
Fedora-44-x86_64N/A2026/09/1808:05:4800:00:00ViewView
NetBSD-11-x86_64N/A2026/09/1811:59:4500:00:00ViewView
Rocky-10-x86_64N/A2026/09/1805:01:0300:00:00ViewView
Rocky-8-x86_64N/A2026/09/1800:49:4400:00:01ViewView
Ubuntu-20.04-x86_64N/A2026/09/2203:39:2900:00:00ViewView
Ubuntu-22.04-x86_64Broken2026/09/2217:58:4500:00:17
make: *** [package] Error 2
ViewViewViewViewViewViewView
Ubuntu-24.04-x86_64N/A2026/09/1806:34:2400:00:00ViewView
Ubuntu-26.04-x86_64N/A2026/09/1805:07:3700:00:00ViewView

py311-sl1m-0.1.1 (category wip or summary)

Platform Status Date Time Log files
Start Total brokenbrokenbybulkcbbh
Debian-11-x86_64N/A2026/09/1802:28:3000:00:00ViewView
Debian-12-x86_64Broken2026/09/2218:18:5800:00:02
Required robotpkg package py311-pycddlib>=2.1.1: BROKEN
View
Debian-13-x86_64N/A2026/09/1804:46:5700:00:00ViewView
Fedora-42-x86_64N/A2026/09/1808:54:3100:00:00ViewView
Fedora-44-x86_64N/A2026/09/1808:05:4800:00:01ViewView
NetBSD-11-x86_64N/A2026/09/1811:59:4600:00:00ViewView
Rocky-10-x86_64N/A2026/09/1805:01:0400:00:00ViewView
Rocky-8-x86_64N/A2026/09/1800:49:4500:00:00ViewView
Ubuntu-20.04-x86_64N/A2026/09/2203:39:2900:00:01ViewView
Ubuntu-22.04-x86_64N/A2026/09/1807:12:0900:00:01ViewView
Ubuntu-24.04-x86_64N/A2026/09/1806:34:2400:00:00ViewView
Ubuntu-26.04-x86_64N/A2026/09/1805:07:3800:00:00ViewView

py312-sl1m-0.1.1 (category wip or summary)

Platform Status Date Time Log files
Start Total brokenbrokenbybuildbulkcbbhcmakeconfigureextractinstallplist
Debian-11-x86_64N/A2026/09/1802:28:3100:00:00ViewView
Debian-12-x86_64N/A2026/09/1807:25:4000:00:00ViewView
Debian-13-x86_64N/A2026/09/1804:46:5800:00:00ViewView
Fedora-42-x86_64N/A2026/09/1808:54:3200:00:00ViewView
Fedora-44-x86_64N/A2026/09/1808:05:4900:00:01ViewView
NetBSD-11-x86_64N/A2026/09/1811:59:4700:00:00ViewView
Rocky-10-x86_64Broken2026/09/2217:38:0600:00:02
Required robotpkg package py312-pycddlib>=2.1.1: BROKEN
View
Rocky-8-x86_64N/A2026/09/1800:49:4500:00:01ViewView
Ubuntu-20.04-x86_64N/A2026/09/2203:39:3000:00:00ViewView
Ubuntu-22.04-x86_64N/A2026/09/1807:12:1000:00:00ViewView
Ubuntu-24.04-x86_64Broken2026/09/2217:40:2300:00:14
make: *** [package] Error 2
ViewViewViewViewViewViewView
Ubuntu-26.04-x86_64N/A2026/09/1805:07:3800:00:01ViewView

py313-sl1m-0.1.1 (category wip or summary)

Platform Status Date Time Log files
Start Total brokenbuildbulkcbbhcmakeconfigureextractinstallplist
Debian-11-x86_64N/A2026/09/1802:28:3100:00:00ViewView
Debian-12-x86_64N/A2026/09/1807:25:4000:00:01ViewView
Debian-13-x86_64Broken2026/09/2218:20:0400:00:17
make: *** [package] Error 2
ViewViewViewViewViewViewView
Fedora-42-x86_64Broken2026/09/2217:35:3100:00:15
make: *** [package] Error 2
ViewViewViewViewViewViewView
Fedora-44-x86_64N/A2026/09/1808:05:5000:00:01ViewView
NetBSD-11-x86_64Broken2026/09/2217:40:2500:00:04
/usr/pkg/bin/gmake: *** [package] Error 2
ViewViewViewView
Rocky-10-x86_64N/A2026/09/1805:01:0700:00:00ViewView
Rocky-8-x86_64N/A2026/09/1800:49:4600:00:00ViewView
Ubuntu-20.04-x86_64N/A2026/09/2203:39:3000:00:00ViewView
Ubuntu-22.04-x86_64N/A2026/09/1807:12:1000:00:01ViewView
Ubuntu-24.04-x86_64N/A2026/09/1806:34:3800:00:01ViewView
Ubuntu-26.04-x86_64N/A2026/09/1805:07:3900:00:00ViewView

py314-sl1m-0.1.1 (category wip or summary)

Platform Status Date Time Log files
Start Total brokenbulkcbbhcmakeconfigureextract
Debian-11-x86_64N/A2026/09/1802:28:3100:00:01ViewView
Debian-12-x86_64N/A2026/09/1807:25:4100:00:00ViewView
Debian-13-x86_64N/A2026/09/1804:47:1400:00:00ViewView
Fedora-42-x86_64N/A2026/09/1808:54:5200:00:00ViewView
Fedora-44-x86_64Broken2026/09/2217:36:4400:00:04
make: *** [package] Error 2
ViewViewViewView
NetBSD-11-x86_64N/A2026/09/1811:59:5400:00:00ViewView
Rocky-10-x86_64N/A2026/09/1805:01:0700:00:01ViewView
Rocky-8-x86_64N/A2026/09/1800:49:4600:00:00ViewView
Ubuntu-20.04-x86_64N/A2026/09/2203:39:3100:00:00ViewView
Ubuntu-22.04-x86_64N/A2026/09/1807:12:1100:00:00ViewView
Ubuntu-24.04-x86_64N/A2026/09/1806:34:3900:00:00ViewView
Ubuntu-26.04-x86_64Broken2026/09/2218:33:5100:00:04
make: *** [package] Error 2
ViewViewViewView

py36-sl1m-0.1.1 (category wip or summary)

Platform Status Date Time Log files
Start Total bulkcbbh
Debian-11-x86_64N/A2026/09/1802:28:3200:00:00ViewView
Debian-12-x86_64N/A2026/09/1807:25:4200:00:00ViewView
Debian-13-x86_64N/A2026/09/1804:47:1500:00:00ViewView
Fedora-42-x86_64N/A2026/09/1808:54:5300:00:00ViewView
Fedora-44-x86_64N/A2026/09/1808:05:5700:00:01ViewView
NetBSD-11-x86_64N/A2026/09/1811:59:5500:00:00ViewView
Rocky-10-x86_64N/A2026/09/1805:01:0800:00:00ViewView
Rocky-8-x86_64OK2026/09/1800:49:4600:00:12
Ubuntu-20.04-x86_64N/A2026/09/2203:39:3100:00:00ViewView
Ubuntu-22.04-x86_64N/A2026/09/1807:12:1200:00:00ViewView
Ubuntu-24.04-x86_64N/A2026/09/1806:34:3900:00:00ViewView
Ubuntu-26.04-x86_64N/A2026/09/1805:07:4200:00:01ViewView

py38-sl1m-0.1.1 (category wip or summary)

Platform Status Date Time Log files
Start Total bulkcbbhcbbhby
Debian-11-x86_64N/A2026/09/1802:28:3200:00:00ViewView
Debian-12-x86_64N/A2026/09/1807:25:4200:00:00ViewView
Debian-13-x86_64N/A2026/09/1804:47:1500:00:01ViewView
Fedora-42-x86_64N/A2026/09/1808:54:5300:00:01ViewView
Fedora-44-x86_64N/A2026/09/1808:05:5800:00:01ViewView
NetBSD-11-x86_64N/A2026/09/1811:59:5600:00:00ViewView
Rocky-10-x86_64N/A2026/09/1805:01:0900:00:00ViewView
Rocky-8-x86_64N/A2026/09/1800:49:5800:00:00ViewView
Ubuntu-20.04-x86_64N/A2026/09/2218:02:4700:00:03ViewView
cmake>=3.22
Ubuntu-22.04-x86_64N/A2026/09/1807:12:1200:00:01ViewView
Ubuntu-24.04-x86_64N/A2026/09/1806:34:4000:00:00ViewView
Ubuntu-26.04-x86_64N/A2026/09/1805:07:4300:00:00ViewView

py39-sl1m-0.1.1 (category wip or summary)

Platform Status Date Time Log files
Start Total bulkcbbhcbbhby
Debian-11-x86_64N/A2026/09/2217:37:2500:00:01ViewView
cmake>=3.22
Debian-12-x86_64N/A2026/09/1807:25:4300:00:00ViewView
Debian-13-x86_64N/A2026/09/1804:47:1600:00:00ViewView
Fedora-42-x86_64N/A2026/09/1808:54:5400:00:01ViewView
Fedora-44-x86_64N/A2026/09/1808:05:5900:00:00ViewView
NetBSD-11-x86_64N/A2026/09/1811:59:5700:00:01ViewView
Rocky-10-x86_64N/A2026/09/1805:01:0900:00:00ViewView
Rocky-8-x86_64N/A2026/09/1800:49:5900:00:00ViewView
Ubuntu-20.04-x86_64N/A2026/09/2203:39:3400:00:01ViewView
Ubuntu-22.04-x86_64N/A2026/09/1807:12:1300:00:00ViewView
Ubuntu-24.04-x86_64N/A2026/09/1806:34:4000:00:00ViewView
Ubuntu-26.04-x86_64N/A2026/09/1805:07:4400:00:00ViewView