robotpkg/wip/py-pycddlib bulk build results

py27-pycddlib-2.1.7 (category optimization or summary)

Platform Status Date Time Log files
Start Total brokenbuildbulkcbbhcbbhbyconfigureextractsysdep
Debian-11-x86_64N/A2026/09/1802:21:3500:00:01ViewView
Debian-12-x86_64N/A2026/09/1806:53:4900:00:00ViewView
Debian-13-x86_64N/A2026/09/1804:28:4700:00:00ViewView
Fedora-42-x86_64N/A2026/09/1808:31:0300:00:00ViewView
Fedora-44-x86_64N/A2026/09/1807:51:3700:00:00ViewView
NetBSD-11-x86_64N/A2026/09/1811:55:0600:00:01ViewView
Rocky-10-x86_64N/A2026/09/1804:32:2200:00:00ViewView
Rocky-8-x86_64N/A2026/09/1800:49:1000:00:00ViewView
Ubuntu-20.04-x86_64Broken2026/09/2203:35:4600:00:11
make: *** [package] Error 2
ViewViewViewView
Ubuntu-22.04-x86_64Sysdep2026/09/2203:12:3700:00:05ViewView
py27-cython>=0.20.0
View
Ubuntu-24.04-x86_64N/A2026/09/1806:05:3000:00:00ViewView
Ubuntu-26.04-x86_64N/A2026/09/1805:02:4800:00:00ViewView

py310-pycddlib-2.1.7 (category optimization or summary)

Platform Status Date Time Log files
Start Total brokenbuildbulkcbbhconfigureextract
Debian-11-x86_64N/A2026/09/1802:21:3600:00:00ViewView
Debian-12-x86_64N/A2026/09/1806:53:4900:00:01ViewView
Debian-13-x86_64N/A2026/09/1804:28:4700:00:00ViewView
Fedora-42-x86_64N/A2026/09/1808:31:0400:00:00ViewView
Fedora-44-x86_64N/A2026/09/1807:51:3700:00:01ViewView
NetBSD-11-x86_64N/A2026/09/1811:55:0700:00:01ViewView
Rocky-10-x86_64N/A2026/09/1804:32:2300:00:00ViewView
Rocky-8-x86_64N/A2026/09/1800:49:1000:00:00ViewView
Ubuntu-20.04-x86_64N/A2026/09/2117:36:4400:00:01ViewView
Ubuntu-22.04-x86_64Broken2026/09/2203:12:0200:00:35
make: *** [package] Error 2
ViewViewViewView
Ubuntu-24.04-x86_64N/A2026/09/1806:05:3000:00:00ViewView
Ubuntu-26.04-x86_64N/A2026/09/1805:02:4800:00:01ViewView

py311-pycddlib-2.1.7 (category optimization or summary)

Platform Status Date Time Log files
Start Total brokenbuildbulkcbbhconfigureextract
Debian-11-x86_64N/A2026/09/1802:21:3600:00:00ViewView
Debian-12-x86_64Broken2026/09/2203:08:4400:00:08
make: *** [package] Error 2
ViewViewViewView
Debian-13-x86_64N/A2026/09/1804:28:4700:00:01ViewView
Fedora-42-x86_64N/A2026/09/1808:31:0500:00:00ViewView
Fedora-44-x86_64N/A2026/09/1807:51:3800:00:00ViewView
NetBSD-11-x86_64N/A2026/09/1811:55:0800:00:00ViewView
Rocky-10-x86_64N/A2026/09/1804:32:2300:00:00ViewView
Rocky-8-x86_64N/A2026/09/1800:49:1000:00:01ViewView
Ubuntu-20.04-x86_64N/A2026/09/2117:36:4500:00:00ViewView
Ubuntu-22.04-x86_64N/A2026/09/1807:10:3800:00:00ViewView
Ubuntu-24.04-x86_64N/A2026/09/1806:05:3100:00:00ViewView
Ubuntu-26.04-x86_64N/A2026/09/1805:02:4900:00:00ViewView

py312-pycddlib-2.1.7 (category optimization or summary)

Platform Status Date Time Log files
Start Total brokenbuildbulkcbbhconfigureextract
Debian-11-x86_64N/A2026/09/1802:21:3600:00:01ViewView
Debian-12-x86_64N/A2026/09/1806:53:5000:00:00ViewView
Debian-13-x86_64N/A2026/09/1804:28:4800:00:00ViewView
Fedora-42-x86_64N/A2026/09/1808:31:0500:00:01ViewView
Fedora-44-x86_64N/A2026/09/1807:51:3900:00:00ViewView
NetBSD-11-x86_64N/A2026/09/1811:55:0900:00:00ViewView
Rocky-10-x86_64Broken2026/09/2203:18:3600:00:35
make: *** [package] Error 2
ViewViewViewView
Rocky-8-x86_64N/A2026/09/1800:49:1100:00:00ViewView
Ubuntu-20.04-x86_64N/A2026/09/2117:36:4600:00:00ViewView
Ubuntu-22.04-x86_64N/A2026/09/1807:10:3800:00:00ViewView
Ubuntu-24.04-x86_64OK2026/09/1806:04:3200:00:58
Ubuntu-26.04-x86_64N/A2026/09/1805:02:4900:00:01ViewView

py313-pycddlib-2.1.7 (category optimization or summary)

Platform Status Date Time Log files
Start Total bulkcbbh
Debian-11-x86_64N/A2026/09/1802:21:3700:00:00ViewView
Debian-12-x86_64N/A2026/09/1806:53:5000:00:00ViewView
Debian-13-x86_64OK2026/09/1804:27:3700:01:09
Fedora-42-x86_64OK2026/09/1808:31:0600:00:44
Fedora-44-x86_64N/A2026/09/1807:51:3900:00:01ViewView
NetBSD-11-x86_64OK2026/09/1811:55:1000:00:37
Rocky-10-x86_64N/A2026/09/1804:32:3000:00:01ViewView
Rocky-8-x86_64N/A2026/09/1800:49:1100:00:00ViewView
Ubuntu-20.04-x86_64N/A2026/09/2117:36:4600:00:01ViewView
Ubuntu-22.04-x86_64N/A2026/09/1807:10:3900:00:00ViewView
Ubuntu-24.04-x86_64N/A2026/09/1806:05:3100:00:00ViewView
Ubuntu-26.04-x86_64N/A2026/09/1805:02:5000:00:00ViewView

py314-pycddlib-2.1.7 (category optimization or summary)

Platform Status Date Time Log files
Start Total bulkcbbh
Debian-11-x86_64N/A2026/09/1802:21:3700:00:00ViewView
Debian-12-x86_64N/A2026/09/1806:53:5100:00:00ViewView
Debian-13-x86_64N/A2026/09/1804:28:4800:00:00ViewView
Fedora-42-x86_64N/A2026/09/1808:31:5000:00:01ViewView
Fedora-44-x86_64OK2026/09/1807:51:4000:00:42
NetBSD-11-x86_64N/A2026/09/1811:55:4800:00:00ViewView
Rocky-10-x86_64N/A2026/09/1804:32:3100:00:00ViewView
Rocky-8-x86_64N/A2026/09/1800:49:1200:00:00ViewView
Ubuntu-20.04-x86_64N/A2026/09/2117:36:4700:00:00ViewView
Ubuntu-22.04-x86_64N/A2026/09/1807:10:3900:00:01ViewView
Ubuntu-24.04-x86_64N/A2026/09/1806:05:3100:00:00ViewView
Ubuntu-26.04-x86_64OK2026/09/1805:01:4200:01:06

py36-pycddlib-2.1.7 (category optimization or summary)

Platform Status Date Time Log files
Start Total brokenbuildbulkcbbhconfigureextract
Debian-11-x86_64N/A2026/09/1802:21:3800:00:00ViewView
Debian-12-x86_64N/A2026/09/1806:53:5100:00:00ViewView
Debian-13-x86_64N/A2026/09/1804:28:4900:00:00ViewView
Fedora-42-x86_64N/A2026/09/1808:31:5100:00:00ViewView
Fedora-44-x86_64N/A2026/09/1807:52:2200:00:01ViewView
NetBSD-11-x86_64N/A2026/09/1811:55:4900:00:00ViewView
Rocky-10-x86_64N/A2026/09/1804:32:3100:00:01ViewView
Rocky-8-x86_64Broken2026/09/2203:49:0500:00:15
make: *** [package] Error 2
ViewViewViewView
Ubuntu-20.04-x86_64N/A2026/09/2117:36:4800:00:00ViewView
Ubuntu-22.04-x86_64N/A2026/09/1807:10:4000:00:00ViewView
Ubuntu-24.04-x86_64N/A2026/09/1806:05:3200:00:00ViewView
Ubuntu-26.04-x86_64N/A2026/09/1805:02:5000:00:00ViewView

py38-pycddlib-2.1.7 (category optimization or summary)

Platform Status Date Time Log files
Start Total brokenbuildbulkcbbhconfigureextract
Debian-11-x86_64N/A2026/09/1802:21:3800:00:00ViewView
Debian-12-x86_64N/A2026/09/1806:53:5100:00:01ViewView
Debian-13-x86_64N/A2026/09/1804:28:4900:00:00ViewView
Fedora-42-x86_64N/A2026/09/1808:31:5200:00:00ViewView
Fedora-44-x86_64N/A2026/09/1807:52:2300:00:01ViewView
NetBSD-11-x86_64N/A2026/09/1811:55:4900:00:01ViewView
Rocky-10-x86_64N/A2026/09/1804:32:3200:00:00ViewView
Rocky-8-x86_64N/A2026/09/1800:49:2300:00:00ViewView
Ubuntu-20.04-x86_64Broken2026/09/2203:35:5800:00:11
make: *** [package] Error 2
ViewViewViewView
Ubuntu-22.04-x86_64N/A2026/09/1807:10:4000:00:01ViewView
Ubuntu-24.04-x86_64N/A2026/09/1806:05:3200:00:00ViewView
Ubuntu-26.04-x86_64N/A2026/09/1805:02:5100:00:00ViewView

py39-pycddlib-2.1.7 (category optimization or summary)

Platform Status Date Time Log files
Start Total brokenbuildbulkcbbhconfigureextract
Debian-11-x86_64Broken2026/09/2203:04:3400:00:23
make: *** [package] Error 2
ViewViewViewView
Debian-12-x86_64N/A2026/09/1806:53:5200:00:00ViewView
Debian-13-x86_64N/A2026/09/1804:28:4900:00:00ViewView
Fedora-42-x86_64N/A2026/09/1808:31:5300:00:00ViewView
Fedora-44-x86_64N/A2026/09/1807:52:2400:00:00ViewView
NetBSD-11-x86_64N/A2026/09/1811:55:5000:00:01ViewView
Rocky-10-x86_64N/A2026/09/1804:32:3300:00:00ViewView
Rocky-8-x86_64N/A2026/09/1800:49:2300:00:01ViewView
Ubuntu-20.04-x86_64N/A2026/09/2117:36:5800:00:00ViewView
Ubuntu-22.04-x86_64N/A2026/09/1807:10:4100:00:00ViewView
Ubuntu-24.04-x86_64N/A2026/09/1806:05:3200:00:01ViewView
Ubuntu-26.04-x86_64N/A2026/09/1805:02:5100:00:00ViewView