robotpkg/wip/py-pycddlib bulk build results
Log for py312-pycddlib-2.1.7 on Rocky-10-x86_64: bulk.log (Back)
=> Checking for clear installation
===> Installing bootstrap dependencies for py312-pycddlib-2.1.7
=> Installing /opt/robotpkg/var/lib/robotpkg/packages/bsd/Rocky-10-x86_64/All/digest-20080510.tgz
=> Installing /opt/robotpkg/var/lib/robotpkg/packages/bsd/Rocky-10-x86_64/All/tnftp-20151004~ssl.tgz
===> Checking bootstrap dependencies for py312-pycddlib-2.1.7
=> Required robotpkg package digest>=20080510: digest-20080510 found
=> Required robotpkg package tnftp>=20130505~ssl: tnftp-20151004~ssl found
=> Required system package gzip: gzip-1.13 found
=> Required system package pax and tar archivers: pax found
=> Required system package pkg_install>=20110805.12: pkg_install-20211115.4 found
===> Done bootstrap-depends for py312-pycddlib-2.1.7
===> Installing full dependencies for py312-pycddlib-2.1.7
=> Dependency digest-20080510 already installed
=> Dependency tnftp-20151004~ssl already installed
===> Checking build options for py312-pycddlib-2.1.7
=> Building with no option.
===> Checking alternatives for py312-pycddlib-2.1.7
=> Use the GNU C++ compiler: c++-compiler provided by g++>=3
=> Use the GNU C compiler: c-compiler provided by gcc>=3
=> Use python-3.12: python>=2.5 provided by python312>=3.12<3.13
===> Checking dependencies for py312-pycddlib-2.1.7
=> Required system package g++>=3: g++-14.3.1 found
=> Required system package gcc>=3: gcc-14.3.1 found
=> Required system package libstdc++: libstdc++ found
=> Required system package py312-cython>=0.20.0: py312-cython-3.0.9 found
=> Required system package py312-setuptools: py312-setuptools found
=> Required system package python312>=3.12<3.13: python312-3.12.14 found
===> Done depends for py312-pycddlib-2.1.7
===> Extracting for py312-pycddlib-2.1.7
=> SHA1 checksums OK
=> RMD160 checksums OK
===> Configuring for py312-pycddlib-2.1.7
===> Building for py312-pycddlib-2.1.7
/usr/lib/python3.12/site-packages/setuptools/__init__.py:80: _DeprecatedInstaller: setuptools.installer and fetch_build_eggs are deprecated.
!!
********************************************************************************
Requirements should be satisfied by a PEP 517 installer.
If you are using pip, you can try `pip install --use-pep517`.
********************************************************************************
!!
dist.fetch_build_eggs(dist.setup_requires)
WARNING: The wheel package is not available.
In file included from cddlib/lib-src/cdd.h:17,
from cdd.c:1244:
cddlib/lib-src/cddmp.h:30:11: fatal error: gmp.h: No such file or directory
30 | #include "gmp.h"
| ^~~~~~~
compilation terminated.
error: command '/usr/bin/gcc' failed with exit code 1
An unexpected error occured. The last 10 log lines are shown below.
| creating build/temp.linux-x86_64-cpython-312/cddlib
| creating build/temp.linux-x86_64-cpython-312/cddlib/lib-src
| /usr/bin/gcc -fno-strict-overflow -Wsign-compare -DDYNAMIC_ANNOTATIONS_ENABLED=1 -DNDEBUG -fexceptions -fcf-protection -fexceptions -fcf-protection -fexceptions -fcf-protection -O3 -fPIC -DGMPRATIONAL -Icddlib/lib-src -I/usr/include/python3.12 -c cdd.c -o build/temp.linux-x86_64-cpython-312/cdd.o
| In file included from cddlib/lib-src/cdd.h:17,
| from cdd.c:1244:
| cddlib/lib-src/cddmp.h:30:11: fatal error: gmp.h: No such file or directory
| 30 | #include "gmp.h"
| | ^~~~~~~
| compilation terminated.
| error: command '/usr/bin/gcc' failed with exit code 1
For details or bug reports, check the complete log file in:
/local/robotpkg/var/tmp/robotpkg/wip/py-pycddlib/work/build.log
make[3]: *** [../../mk/sysdep/py-setuptools.mk:48: do-build-setuptools(/local/robotpkg/var/tmp/robotpkg/wip/py-pycddlib/work/pycddlib-2.1.7)] Error 1
make[2]: *** [/local/robotpkg/var/lib/robotpkg/mk/pkg/package.mk:42: pkg-check-installed] Error 2
=> Marking py312-pycddlib-2.1.7 as broken
ERROR: make: *** [package] Error 2
===> Deinstalling for py312-pycddlib
Removed digest-20080510
Removed tnftp-20151004~ssl