robotpkg/wip/py-qpoases bulk build results

py27-qpoases-3.2.1 (category optimization or summary)

Platform Status Date Time Log files
Start Total bulkcbbhcbbhbysysdep
Debian-11-x86_64N/A2026/09/1802:19:3800:00:00ViewView
Debian-12-x86_64N/A2026/09/1806:33:5600:00:00ViewView
Debian-13-x86_64N/A2026/09/1804:51:4500:00:00ViewView
Fedora-42-x86_64N/A2026/09/1808:10:5600:00:01ViewView
Fedora-44-x86_64N/A2026/09/1807:44:0200:00:00ViewView
NetBSD-11-x86_64N/A2026/09/1811:43:1600:00:00ViewView
Rocky-10-x86_64N/A2026/09/1804:32:1200:00:01ViewView
Rocky-8-x86_64N/A2026/09/1801:27:0100:00:01ViewView
Ubuntu-20.04-x86_64Sysdep2026/09/3021:03:3200:00:03ViewView
py27-numpy>=1
View
Ubuntu-22.04-x86_64Sysdep2026/09/3021:34:1400:00:04ViewView
py27-cython>=0.20.0
py27-numpy>=1
View
Ubuntu-24.04-x86_64N/A2026/09/1807:07:3100:00:00ViewView
Ubuntu-26.04-x86_64N/A2026/09/1804:59:0700:00:01ViewView

py310-qpoases-3.2.1 (category optimization or summary)

Platform Status Date Time Log files
Start Total brokenbuildbulkcbbhconfigureextract
Debian-11-x86_64N/A2026/09/1802:19:3800:00:00ViewView
Debian-12-x86_64N/A2026/09/1806:33:5600:00:01ViewView
Debian-13-x86_64N/A2026/09/1804:51:4500:00:00ViewView
Fedora-42-x86_64N/A2026/09/1808:10:5700:00:00ViewView
Fedora-44-x86_64N/A2026/09/1807:44:0300:00:00ViewView
NetBSD-11-x86_64N/A2026/09/1811:43:1700:00:00ViewView
Rocky-10-x86_64N/A2026/09/1804:32:1300:00:00ViewView
Rocky-8-x86_64N/A2026/09/1801:27:0200:00:00ViewView
Ubuntu-20.04-x86_64N/A2026/09/2117:35:1000:00:00ViewView
Ubuntu-22.04-x86_64Broken2026/09/3021:34:1800:00:21
make: *** [package] Error 2
ViewViewViewView
Ubuntu-24.04-x86_64N/A2026/09/1807:07:3200:00:00ViewView
Ubuntu-26.04-x86_64N/A2026/09/1804:59:0800:00:00ViewView

py311-qpoases-3.2.1 (category optimization or summary)

Platform Status Date Time Log files
Start Total brokenbuildbulkcbbhconfigureextract
Debian-11-x86_64N/A2026/09/1802:19:3900:00:00ViewView
Debian-12-x86_64Broken2026/09/3021:24:1800:00:35
make: *** [package] Error 2
ViewViewViewView
Debian-13-x86_64N/A2026/09/1804:51:4500:00:01ViewView
Fedora-42-x86_64N/A2026/09/1808:10:5800:00:00ViewView
Fedora-44-x86_64N/A2026/09/1807:44:0300:00:01ViewView
NetBSD-11-x86_64N/A2026/09/1811:43:1800:00:00ViewView
Rocky-10-x86_64N/A2026/09/1804:32:1400:00:00ViewView
Rocky-8-x86_64N/A2026/09/1801:27:0200:00:01ViewView
Ubuntu-20.04-x86_64N/A2026/09/2117:35:1100:00:00ViewView
Ubuntu-22.04-x86_64N/A2026/09/1808:09:1100:00:01ViewView
Ubuntu-24.04-x86_64N/A2026/09/1807:07:3200:00:00ViewView
Ubuntu-26.04-x86_64N/A2026/09/1804:59:0800:00:01ViewView

py312-qpoases-3.2.1 (category optimization or summary)

Platform Status Date Time Log files
Start Total brokenbuildbulkcbbhconfigureextract
Debian-11-x86_64N/A2026/09/1802:19:3900:00:00ViewView
Debian-12-x86_64N/A2026/09/1806:34:0300:00:00ViewView
Debian-13-x86_64N/A2026/09/1804:51:4600:00:00ViewView
Fedora-42-x86_64N/A2026/09/1808:10:5900:00:00ViewView
Fedora-44-x86_64N/A2026/09/1807:44:0400:00:00ViewView
NetBSD-11-x86_64N/A2026/09/1811:43:1900:00:00ViewView
Rocky-10-x86_64Broken2026/09/3020:59:5100:00:05
make: *** [package] Error 2
ViewViewViewView
Rocky-8-x86_64N/A2026/09/1801:27:0300:00:00ViewView
Ubuntu-20.04-x86_64N/A2026/09/2117:35:1100:00:01ViewView
Ubuntu-22.04-x86_64N/A2026/09/1808:09:1200:00:00ViewView
Ubuntu-24.04-x86_64Broken2026/09/3021:19:1800:00:05
make: *** [package] Error 2
ViewViewViewView
Ubuntu-26.04-x86_64N/A2026/09/1804:59:0900:00:00ViewView

py313-qpoases-3.2.1 (category optimization or summary)

Platform Status Date Time Log files
Start Total brokenbuildbulkcbbhconfigureextract
Debian-11-x86_64N/A2026/09/1802:19:3900:00:01ViewView
Debian-12-x86_64N/A2026/09/1806:34:0400:00:00ViewView
Debian-13-x86_64Broken2026/09/3021:29:3200:00:05
make: *** [package] Error 2
ViewViewViewView
Fedora-42-x86_64Broken2026/09/3021:22:5200:00:07
make: *** [package] Error 2
ViewViewViewView
Fedora-44-x86_64N/A2026/09/1807:44:0500:00:00ViewView
NetBSD-11-x86_64Broken2026/09/3021:44:4400:00:06
/usr/pkg/bin/gmake: *** [package] Error 2
ViewViewViewView
Rocky-10-x86_64N/A2026/09/1804:32:1900:00:00ViewView
Rocky-8-x86_64N/A2026/09/1801:27:0300:00:00ViewView
Ubuntu-20.04-x86_64N/A2026/09/2117:35:1200:00:00ViewView
Ubuntu-22.04-x86_64N/A2026/09/1808:09:1200:00:01ViewView
Ubuntu-24.04-x86_64N/A2026/09/1807:07:3700:00:00ViewView
Ubuntu-26.04-x86_64N/A2026/09/1804:59:0900:00:01ViewView

py314-qpoases-3.2.1 (category optimization or summary)

Platform Status Date Time Log files
Start Total brokenbuildbulkcbbhconfigureextract
Debian-11-x86_64N/A2026/09/1802:19:4000:00:00ViewView
Debian-12-x86_64N/A2026/09/1806:34:0400:00:00ViewView
Debian-13-x86_64N/A2026/09/1804:51:5000:00:00ViewView
Fedora-42-x86_64N/A2026/09/1808:11:0700:00:00ViewView
Fedora-44-x86_64Broken2026/09/3020:57:1500:00:16
make: *** [package] Error 2
ViewViewViewView
NetBSD-11-x86_64N/A2026/09/1811:43:2600:00:01ViewView
Rocky-10-x86_64N/A2026/09/1804:32:2000:00:00ViewView
Rocky-8-x86_64N/A2026/09/1801:27:0400:00:00ViewView
Ubuntu-20.04-x86_64N/A2026/09/2117:35:1300:00:00ViewView
Ubuntu-22.04-x86_64N/A2026/09/1808:09:1300:00:00ViewView
Ubuntu-24.04-x86_64N/A2026/09/1807:07:3700:00:01ViewView
Ubuntu-26.04-x86_64Broken2026/09/3021:00:1700:00:05
make: *** [package] Error 2
ViewViewViewView

py36-qpoases-3.2.1 (category optimization or summary)

Platform Status Date Time Log files
Start Total brokenbuildbulkcbbhconfigureextract
Debian-11-x86_64N/A2026/09/1802:19:4000:00:00ViewView
Debian-12-x86_64N/A2026/09/1806:34:0400:00:00ViewView
Debian-13-x86_64N/A2026/09/1804:51:5000:00:01ViewView
Fedora-42-x86_64N/A2026/09/1808:11:0800:00:00ViewView
Fedora-44-x86_64N/A2026/09/1807:44:1100:00:01ViewView
NetBSD-11-x86_64N/A2026/09/1811:43:2700:00:01ViewView
Rocky-10-x86_64N/A2026/09/1804:32:2000:00:01ViewView
Rocky-8-x86_64Broken2026/09/3021:32:0900:00:07
make: *** [package] Error 2
ViewViewViewView
Ubuntu-20.04-x86_64N/A2026/09/2117:35:1400:00:00ViewView
Ubuntu-22.04-x86_64N/A2026/09/1808:09:1400:00:00ViewView
Ubuntu-24.04-x86_64N/A2026/09/1807:07:3800:00:00ViewView
Ubuntu-26.04-x86_64N/A2026/09/1804:59:1400:00:00ViewView

py38-qpoases-3.2.1 (category optimization or summary)

Platform Status Date Time Log files
Start Total brokenbuildbulkcbbhconfigureextract
Debian-11-x86_64N/A2026/09/1802:19:4000:00:01ViewView
Debian-12-x86_64N/A2026/09/1806:34:0500:00:00ViewView
Debian-13-x86_64N/A2026/09/1804:51:5100:00:00ViewView
Fedora-42-x86_64N/A2026/09/1808:11:0800:00:01ViewView
Fedora-44-x86_64N/A2026/09/1807:44:1200:00:00ViewView
NetBSD-11-x86_64N/A2026/09/1811:43:2800:00:01ViewView
Rocky-10-x86_64N/A2026/09/1804:32:2100:00:00ViewView
Rocky-8-x86_64N/A2026/09/1801:27:0900:00:00ViewView
Ubuntu-20.04-x86_64Broken2026/09/3021:03:3500:00:26
make: *** [package] Error 2
ViewViewViewView
Ubuntu-22.04-x86_64N/A2026/09/1808:09:1400:00:01ViewView
Ubuntu-24.04-x86_64N/A2026/09/1807:07:3800:00:01ViewView
Ubuntu-26.04-x86_64N/A2026/09/1804:59:1500:00:00ViewView

py39-qpoases-3.2.1 (category optimization or summary)

Platform Status Date Time Log files
Start Total brokenbuildbulkcbbhconfigureextract
Debian-11-x86_64Broken2026/09/3020:39:0600:00:04
make: *** [package] Error 2
ViewViewViewView
Debian-12-x86_64N/A2026/09/1806:34:0500:00:00ViewView
Debian-13-x86_64N/A2026/09/1804:51:5100:00:01ViewView
Fedora-42-x86_64N/A2026/09/1808:11:0900:00:01ViewView
Fedora-44-x86_64N/A2026/09/1807:44:1300:00:00ViewView
NetBSD-11-x86_64N/A2026/09/1811:43:2900:00:00ViewView
Rocky-10-x86_64N/A2026/09/1804:32:2100:00:01ViewView
Rocky-8-x86_64N/A2026/09/1801:27:0900:00:01ViewView
Ubuntu-20.04-x86_64N/A2026/09/2117:35:2400:00:00ViewView
Ubuntu-22.04-x86_64N/A2026/09/1808:09:1500:00:00ViewView
Ubuntu-24.04-x86_64N/A2026/09/1807:07:3900:00:00ViewView
Ubuntu-26.04-x86_64N/A2026/09/1804:59:1500:00:00ViewView