| Platform | Status | Date | Time | Log files | ||||||||
|---|---|---|---|---|---|---|---|---|---|---|---|---|
| Start | Total | broken | brokenby | bulk | cbbh | cbbhby | cmake | configure | extract | |||
| Debian-11-x86_64 | Broken | 2026/09/30 | 20:46:36 | 00:00:09 | make: *** [package] Error 2
| View | View | View | View | |||
| Debian-12-x86_64 | Broken | 2026/09/30 | 21:23:48 | 00:00:07 | make: *** [package] Error 2
| View | View | View | View | |||
| Debian-13-x86_64 | N/A | 2026/09/30 | 21:38:03 | 00:00:03 | View | View | py313-sip>=4<5 | |||||
| Fedora-42-x86_64 | Broken | 2026/09/30 | 21:38:40 | 00:00:06 | make: *** [depends] Error 2
| View | ||||||
| Fedora-44-x86_64 | Broken | 2026/09/30 | 20:59:48 | 00:00:04 | Required robotpkg package py314-prf-ros-control>=0.2: BROKEN
| View | ||||||
| NetBSD-11-x86_64 | N/A | 2026/09/30 | 21:56:19 | 00:00:06 | View | View | py313-sip>=4<5 | |||||
| Rocky-10-x86_64 | N/A | 2026/09/30 | 21:06:06 | 00:00:04 | View | View | poco>=1 py312-sip>=4<5 | |||||
| Rocky-8-x86_64 | N/A | 2026/09/30 | 21:52:19 | 00:00:03 | View | View | poco>=1 | |||||
| Ubuntu-20.04-x86_64 | OK | 2026/09/21 | 18:02:47 | 00:00:38 | ||||||||
| Ubuntu-22.04-x86_64 | Broken | 2026/09/30 | 21:55:11 | 00:00:13 | make: *** [package] Error 2
| View | View | View | View | |||
| Ubuntu-24.04-x86_64 | Broken | 2026/09/30 | 21:24:00 | 00:00:06 | make: *** [depends] Error 2
| View | ||||||
| Ubuntu-26.04-x86_64 | N/A | 2026/09/30 | 21:18:03 | 00:00:06 | View | View | py314-sip>=4<5 | |||||