robotpkg/wip/morse-ros bulk build results

Log for morse-ros-1.4 on Ubuntu-26.04-x86_64: bulk.log (Back)

=> Checking for clear installation ===> Installing bootstrap dependencies for morse-ros-1.4 => Installing /opt/robotpkg/var/lib/robotpkg/packages/bsd/Ubuntu-26.04-x86_64/All/digest-20080510.tgz => Installing /opt/robotpkg/var/lib/robotpkg/packages/bsd/Ubuntu-26.04-x86_64/All/tnftp-20151004~ssl.tgz ===> Checking bootstrap dependencies for morse-ros-1.4 => Required robotpkg package digest>=20080510: digest-20080510 found => Required robotpkg package tnftp>=20130505~ssl: tnftp-20151004~ssl found => Required system package gnupg>=1: gnupg-2.4.8 found => Required system package gzip: gzip-1.14 found => Required system package patch>=2.0: patch-2.8~posix found => Required system package pax and tar archivers: pax found => Required system package pkg_install>=20110805.12: pkg_install-20211115.4 found => Required system package pkgrepo2deb>=1.9: pkgrepo2deb-1.16 found ===> Done bootstrap-depends for morse-ros-1.4 ===> Installing full dependencies for morse-ros-1.4 => Dependency digest-20080510 already installed => Installing /opt/robotpkg/var/lib/robotpkg/packages/bsd/Ubuntu-26.04-x86_64/All/morse-1.4r1~doc.tgz => Installing /opt/robotpkg/var/lib/robotpkg/packages/bsd/Ubuntu-26.04-x86_64/All/py314-catkin-pkg-1.0.0.tgz => Dependency tnftp-20151004~ssl already installed ===> Checking build options for morse-ros-1.4 => Building with no option. ===> Checking alternatives for morse-ros-1.4 => Use the GNU C++ compiler: c++-compiler provided by g++>=3 => Use the GNU C compiler: c-compiler provided by gcc>=3 => Use python-3.14: python>=3.3 provided by python314>=3.14<3.15 ===> Checking dependencies for morse-ros-1.4 => Required system package blender>=2.65: blender-5.0.1 found => Required system package cmake>=2.6: cmake-4.2.3 found => Required system package g++>=3: g++-15.2.0 found => Required system package gcc>=3: gcc-15.2.0 found => Required system package libstdc++: libstdc++ found => Required system package pkg-config>=0.22: pkg-config-2.5.1 found => Required system package py314-numpy>=1: py314-numpy-2.3.5 found => Required system package py314-pyparsing: py314-pyparsing found => Required system package py314-yaml>=3: py314-yaml-6.0.3 found => Required system package python314>=3.14<3.15: python314-3.14.4 found => Required robotpkg package morse>=1.0: morse-1.4r1~doc found => Required robotpkg package py314-catkin-pkg>=0.2: py314-catkin-pkg-1.0.0 found ===> Done depends for morse-ros-1.4 ===> Extracting for morse-ros-1.4 => SHA1 checksums OK => RMD160 checksums OK ===> Patching for morse-ros-1.4 => Applying robotpkg patches for morse-ros-1.4 ===> Configuring for morse-ros-1.4 CMake Error at CMakeLists.txt:1 (cmake_minimum_required): Compatibility with CMake < 3.5 has been removed from CMake. Update the VERSION argument <min> value. Or, use the <min>...<max> syntax to tell CMake that the project requires at least <min> but has been updated to work with policies introduced by <max> or earlier. Or, add -DCMAKE_POLICY_VERSION_MINIMUM=3.5 to try configuring anyway. An unexpected error occured. The last 10 log lines are shown below. | Compatibility with CMake < 3.5 has been removed from CMake. | | -- Configuring incomplete, errors occurred! | Update the VERSION argument <min> value. Or, use the <min>...<max> syntax | to tell CMake that the project requires at least <min> but has been updated | to work with policies introduced by <max> or earlier. | | Or, add -DCMAKE_POLICY_VERSION_MINIMUM=3.5 to try configuring anyway. | | For details or bug reports, check the complete log file in: /local/robotpkg/var/tmp/robotpkg/wip/morse-ros/work/configure.log make[3]: *** [/local/robotpkg/var/lib/robotpkg/mk/configure/cmake-configure.mk:101: do-configure-cmake(/local/robotpkg/var/tmp/robotpkg/wip/morse-ros/work/morse-1.4)] Error 1 make[2]: *** [/local/robotpkg/var/lib/robotpkg/mk/pkg/package.mk:42: pkg-check-installed] Error 2 => Marking morse-ros-1.4 as broken ERROR: make: *** [package] Error 2 ===> Deinstalling for morse-ros Removed digest-20080510 Removed morse-1.4r1~doc Removed py314-catkin-pkg-1.0.0 Removed tnftp-20151004~ssl