robotpkg/wip/morse-ros bulk build results

morse-ros-1.4 (category simulation or summary)

Platform Status Date Time Log files
Start Total brokenbulkcbbhcbbhbycmakeconfigureextractsysdep
Debian-11-x86_64OK2026/09/1802:21:3800:00:41
Debian-12-x86_64OK2026/09/1806:30:1900:00:43
Debian-13-x86_64OK2026/09/1804:10:2200:01:19
Fedora-42-x86_64OK2026/09/1808:08:0500:00:36
Fedora-44-x86_64Broken2026/09/3021:14:3500:00:50
make: *** [package] Error 2
ViewViewViewView
NetBSD-11-x86_64Broken2026/09/3021:39:5900:00:46
/usr/pkg/bin/gmake: *** [package] Error 2
ViewViewViewView
Rocky-10-x86_64Sysdep2026/09/3020:47:2300:00:15ViewView
blender>=2.65
View
Rocky-8-x86_64Sysdep2026/09/3021:31:3100:00:05ViewView
blender>=2.65
View
Ubuntu-20.04-x86_64OK2026/09/2117:18:4600:00:44
Ubuntu-22.04-x86_64OK2026/09/1807:34:5200:00:38
Ubuntu-24.04-x86_64OK2026/09/1806:23:0800:00:43
Ubuntu-26.04-x86_64Broken2026/09/3021:12:4500:00:42
make: *** [package] Error 2
ViewViewViewView