| Platform | Status | Date | Time | Log files | ||||||||
|---|---|---|---|---|---|---|---|---|---|---|---|---|
| Start | Total | broken | build | bulk | cbbh | cbbhby | cmake | configure | extract | |||
| Debian-11-x86_64 | N/A | 2026/09/30 | 20:39:03 | 00:00:02 | View | View | cmake>=3.22 | |||||
| Debian-12-x86_64 | Broken | 2026/09/30 | 21:11:15 | 00:00:20 | make: *** [package] Error 2
| View | View | View | View | View | ||
| Debian-13-x86_64 | Broken | 2026/09/30 | 21:31:32 | 00:00:14 | make: *** [package] Error 2
| View | View | View | View | View | ||
| Fedora-42-x86_64 | Broken | 2026/09/30 | 21:23:54 | 00:00:14 | make: *** [package] Error 2
| View | View | View | View | View | ||
| Fedora-44-x86_64 | Broken | 2026/09/30 | 21:02:13 | 00:00:04 | make: *** [package] Error 2
| View | View | View | View | |||
| NetBSD-11-x86_64 | Broken | 2026/09/30 | 21:47:48 | 00:00:03 | /usr/pkg/bin/gmake: *** [package] Error 2
| View | View | View | View | |||
| Rocky-10-x86_64 | OK | 2026/09/11 | 06:00:37 | 00:00:45 | ||||||||
| Rocky-8-x86_64 | Broken | 2026/09/30 | 21:33:13 | 00:00:07 | make: *** [package] Error 2
| View | View | View | View | |||
| Ubuntu-20.04-x86_64 | N/A | 2026/09/30 | 21:04:01 | 00:00:04 | View | View | cmake>=3.22 | |||||
| Ubuntu-22.04-x86_64 | OK | 2026/09/10 | 14:23:51 | 00:00:55 | ||||||||
| Ubuntu-24.04-x86_64 | Broken | 2026/09/30 | 21:07:53 | 00:00:14 | make: *** [package] Error 2
| View | View | View | View | View | ||
| Ubuntu-26.04-x86_64 | Broken | 2026/09/30 | 20:59:02 | 00:00:04 | make: *** [package] Error 2
| View | View | View | View | |||