| Platform | Status | Date | Time | Log files | |||||
|---|---|---|---|---|---|---|---|---|---|
| Start | Total | broken | bulk | cbbh | cbbhby | fetch | |||
| Debian-11-x86_64 | N/A | 2026/09/ 9 | 01:58:02 | 00:00:03 | View | View | cmake>=3.22 | ||
| Debian-12-x86_64 | Broken | 2026/09/ 9 | 12:10:38 | 00:00:05 | make: *** [package] Error 2
| View | View | ||
| Debian-13-x86_64 | Broken | 2026/09/ 9 | 08:55:49 | 00:00:05 | make: *** [package] Error 2
| View | View | ||
| Fedora-42-x86_64 | Broken | 2026/09/ 8 | 17:34:01 | 00:00:07 | make: *** [package] Error 2
| View | View | ||
| Fedora-44-x86_64 | Broken | 2026/09/ 9 | 06:58:21 | 00:00:07 | make: *** [package] Error 2
| View | View | ||
| NetBSD-10.0-x86_64 | Broken | 2026/09/ 9 | 10:55:16 | 00:00:08 | /usr/pkg/bin/gmake: *** [package] Error 2
| View | View | ||
| Rocky-8-x86_64 | N/A | 2026/09/ 9 | 06:50:26 | 00:00:03 | View | View | poco>=1 | ||
| Ubuntu-20.04-x86_64 | N/A | 2026/09/ 9 | 04:43:06 | 00:00:05 | View | View | cmake>=3.22 | ||
| Ubuntu-22.04-x86_64 | Broken | 2026/09/ 9 | 11:55:27 | 00:00:07 | make: *** [package] Error 2
| View | View | ||
| Ubuntu-24.04-x86_64 | Broken | 2026/09/ 9 | 10:57:20 | 00:00:05 | make: *** [package] Error 2
| View | View | ||
| Ubuntu-26.04-x86_64 | Broken | 2026/09/ 9 | 03:38:36 | 00:00:02 | Required robotpkg package ros-vision-opencv>=1.12: NOT found
| View | |||