robotpkg/simulation/optitrack-gazebo bulk build results

Log for optitrack-gazebo-1.0 on Fedora-37-x86_64: bulk.log (Back)

=> Checking for clear installation ===> Installing bootstrap dependencies for optitrack-gazebo-1.0 => Installing /opt/robotpkg/var/lib/robotpkg/packages/bsd/Fedora-37-x86_64/All/digest-20080510.tgz => Installing /opt/robotpkg/var/lib/robotpkg/packages/bsd/Fedora-37-x86_64/All/tnftp-20151004~ssl.tgz ===> Checking bootstrap dependencies for optitrack-gazebo-1.0 => Required robotpkg package digest>=20080510: digest-20080510 found => Required robotpkg package tnftp>=20130505~ssl: tnftp-20151004~ssl found => Required system package gzip: gzip-1.12 found => Required system package pax and tar archivers: pax found => Required system package pkg_install>=20110805.12: pkg_install-20211115.3 found ===> Done bootstrap-depends for optitrack-gazebo-1.0 ===> Installing full dependencies for optitrack-gazebo-1.0 => Dependency digest-20080510 already installed => Dependency tnftp-20151004~ssl already installed ===> Checking build options for optitrack-gazebo-1.0 => Building with no option. ===> Checking alternatives for optitrack-gazebo-1.0 => Use the GNU C++ compiler: c++-compiler provided by g++>=3 => Use the GNU C compiler: c-compiler provided by gcc>=3 ===> Checking dependencies for optitrack-gazebo-1.0 => Required system package boostlib-filesystem>=1.34.1: boost-libs-1.78.0 found => Required system package boostlib-iostreams>=1.34.1: boost-libs-1.78.0 found => Required system package boostlib-math>=1.34.1: boost-libs-1.78.0 found => Required system package boostlib-thread>=1.34.1: boost-libs-1.78.0 found => Required system package g++>=3: g++-12 found => Required system package gazebo>=1: gazebo-10.1.0 found => Required system package gcc>=3: gcc-12 found => Required system package libstdc++: libstdc++ found => Required system package pkg-config>=0.22: pkg-config-1.8.0 found ===> Done depends for optitrack-gazebo-1.0 ===> Extracting for optitrack-gazebo-1.0 => SHA1 checksums OK => RMD160 checksums OK ===> Configuring for optitrack-gazebo-1.0 => Modifying GNU configure scripts to avoid --recheck ===> Building for optitrack-gazebo-1.0 In file included from /usr/include/boost/bind.hpp:30, from src/plugin.cc:33: /usr/include/boost/bind.hpp:36:1: note: '#pragma message: The practice of declaring the Bind placeholders (_1, _2, ...) in the global namespace is deprecated. Please use + using namespace boost::placeholders, or define BOOST_BIND_GLOBAL_PLACEHOLDERS to retain the current behavior.' 36 | BOOST_PRAGMA_MESSAGE( | ^~~~~~~~~~~~~~~~~~~~ In file included from /usr/include/gazebo-10/gazebo/transport/Connection.hh:21, from /usr/include/gazebo-10/gazebo/transport/transport.hh:3, from /usr/include/gazebo-10/gazebo/gazebo_core.hh:21, from /usr/include/gazebo-10/gazebo/gazebo.hh:20, from src/plugin.cc:34: /usr/include/tbb/task.h:21:139: note: '#pragma message: TBB Warning: tbb/task.h is deprecated. For details, please see Deprecated Features appendix in the TBB reference manual.' 21 | #pragma message("TBB Warning: tbb/task.h is deprecated. For details, please see Deprecated Features appendix in the TBB reference manual.") | ^ /usr/bin/ld: cannot find -lBoost::thread: No such file or directory /usr/bin/ld: cannot find -lBoost::system: No such file or directory /usr/bin/ld: cannot find -lBoost::filesystem: No such file or directory /usr/bin/ld: cannot find -lBoost::program_options: No such file or directory /usr/bin/ld: cannot find -lBoost::regex: No such file or directory /usr/bin/ld: cannot find -lBoost::iostreams: No such file or directory /usr/bin/ld: cannot find -lBoost::date_time: No such file or directory collect2: error: ld returned 1 exit status make: *** [Makefile:520: optitrack-gazebo.la] Error 1 An unexpected error occured. The last 10 log lines are shown below. | libtool: link: /usr/bin/g++ -fPIC -DPIC -shared -nostdlib /usr/lib/gcc/x86_64-redhat-linux/12/../../../../lib64/crti.o /usr/lib/gcc/x86_64-redhat-linux/12/crtbeginS.o src/.libs/optitrack_gazebo_la-plugin.o src/.libs/optitrack_gazebo_la-natnet.o -L/usr/lib64/gazebo-10/plugins -lgazebo_transport -lgazebo_physics -lgazebo_sensors -lgazebo_rendering -lgazebo_gui -lgazebo_client -lgazebo_msgs -lgazebo_common -lgazebo -lBoost::thread -lBoost::system -lBoost::filesystem -lBoost::program_options -lBoost::regex -lBoost::iostreams -lBoost::date_time -lsdformat -ltbb -lignition-transport4 -luuid -lignition-msgs1 -lprotobuf -lignition-math4 -L/usr/lib/gcc/x86_64-redhat-linux/12 -L/usr/lib/gcc/x86_64-redhat-linux/12/../../../../lib64 -L/lib/../lib64 -L/usr/lib/../lib64 -L/usr/lib/gcc/x86_64-redhat-linux/12/../../.. -lstdc++ -lm -lc -lgcc_s /usr/lib/gcc/x86_64-redhat-linux/12/crtendS.o /usr/lib/gcc/x86_64-redhat-linux/12/../../../../lib64/crtn.o -O3 -Wl,-rpath -Wl,/usr/lib64/gazebo-10/plugins -Wl,-soname -Wl,optitrack-gazebo-1.0.so -o .libs/optitrack-gazebo-1.0.so | /usr/bin/ld: cannot find -lBoost::thread: No such file or directory | /usr/bin/ld: cannot find -lBoost::system: No such file or directory | /usr/bin/ld: cannot find -lBoost::filesystem: No such file or directory | /usr/bin/ld: cannot find -lBoost::program_options: No such file or directory | /usr/bin/ld: cannot find -lBoost::regex: No such file or directory => Marking optitrack-gazebo-1.0 as broken | /usr/bin/ld: cannot find -lBoost::iostreams: No such file or directory | /usr/bin/ld: cannot find -lBoost::date_time: No such file or directory | collect2: error: ld returned 1 exit status | make: *** [Makefile:520: optitrack-gazebo.la] Error 1 For details or bug reports, check the complete log file in: /local/robotpkg/var/tmp/robotpkg/simulation/optitrack-gazebo/work/build.log make[3]: *** [/local/robotpkg/var/lib/robotpkg/mk/build/build.mk:204: do-build-make(/local/robotpkg/var/tmp/robotpkg/simulation/optitrack-gazebo/work/optitrack-gazebo-1.0)] Error 2 make[2]: *** [/local/robotpkg/var/lib/robotpkg/mk/pkg/package.mk:42: pkg-check-installed] Error 2 ERROR: make: *** [package] Error 2 ===> Deinstalling for optitrack-gazebo Removed digest-20080510 Removed tnftp-20151004~ssl