robotpkg/simulation/gazebo-ros-pkgs bulk build results

ros-gazebo-ros-pkgs-2.4.13 (category simulation or summary)

Platform Status Date Time Log files
Start Total brokenbuildbulkcbbhcbbhbycmakeconfigureextractinstallplist
Debian-8.2-x86_64Broken2017/07/1818:44:2400:00:51
make: *** [package] Error 2
ViewViewViewView
Fedora-23-x86_64Broken2017/07/1818:35:3600:10:25
make: *** [package] Error 2
ViewViewViewViewViewView
Fedora-24-x86_64OK2017/07/ 520:49:1700:08:24
NetBSD-7.0.1-x86_64N/A2017/07/1819:02:2100:00:23ViewView
bullet>=2.75
OpenNao-1.14.5.1-i386Broken2017/07/1818:36:0900:00:32
make: *** [package] Error 2
ViewViewViewView
OpenNao-2.1.0.19-i386Broken2017/07/1818:57:2900:02:33
make: *** [package] Error 2
ViewViewViewView
Ubuntu-12.04-i386Broken2017/07/1818:32:3100:01:04
make: *** [package] Error 2
ViewViewViewViewView
Ubuntu-12.04-x86_64Broken2017/07/1818:51:4900:00:35
make: *** [package] Error 2
ViewViewViewViewView
Ubuntu-14.04-x86_64Broken2017/07/1818:55:2900:05:31
make: *** [package] Error 2
ViewViewViewViewViewView
Ubuntu-16.04-x86_64OK2017/07/ 518:00:1000:12:48
Ubuntu-16.10-x86_64Warnings2017/07/ 518:49:3300:12:11ViewViewViewViewViewView