robotpkg/localization/pom-genom3 bulk build results

pom-genom3-2.3r1~codels+openprs+pocolibs-client-c+pocolibs-server (category localization or summary)

Platform Status Date Time Log files
Start Total autoconfbrokenbuildbulkconfigureextract
Debian-8.2-x86_64OK2018/02/2202:31:4100:02:33
Fedora-26-x86_64OK2018/02/2204:07:3000:04:07
Fedora-27-x86_64OK2018/02/2209:37:3600:03:03
NetBSD-7.1_STABLE-x86_64OK2018/02/2201:26:2700:02:42
OpenNao-2.1.0.19-i386OK2018/02/2205:41:4200:02:30
Ubuntu-12.04-i386Broken2018/02/2211:43:2500:01:31View
make: *** [package] Error 2
ViewViewViewView
Ubuntu-12.04-x86_64Broken2018/02/2211:42:0700:01:21View
make: *** [package] Error 2
ViewViewViewView
Ubuntu-14.04-x86_64OK2018/02/ 520:01:0300:02:58
Ubuntu-16.04-x86_64OK2018/02/ 519:23:3900:03:19
Ubuntu-17.10-x86_64OK2018/02/2203:36:5900:03:18

pom-genom3-2.3r1~codels+openprs+ros-client-c+ros-client-ros+ros-server (category localization or summary)

Platform Status Date Time Log files
Start Total autoconfbrokenbuildbulkconfigureextract
Debian-8.2-x86_64OK2018/02/2212:15:0600:03:20
Fedora-26-x86_64OK2018/02/2204:11:3800:04:56
Fedora-27-x86_64OK2018/02/2212:32:4700:04:40
NetBSD-7.1_STABLE-x86_64OK2018/02/2201:29:1000:03:59
OpenNao-2.1.0.19-i386OK2018/02/2212:51:0900:05:33
Ubuntu-12.04-i386Broken2018/02/2211:44:5800:01:54View
make: *** [package] Error 2
ViewViewViewView
Ubuntu-12.04-x86_64Broken2018/02/2211:43:2800:01:51View
make: *** [package] Error 2
ViewViewViewView
Ubuntu-14.04-x86_64OK2018/02/ 520:04:0200:05:23
Ubuntu-16.04-x86_64OK2018/02/ 519:26:5900:05:14
Ubuntu-17.10-x86_64OK2018/02/2203:40:1800:06:26