robotpkg/interfaces/fts-libgenom3 bulk build results

Log for fts-libgenom3-1.0 on NetBSD-11-x86_64: bulk.log (Back)

=> Checking for clear installation ===> Installing bootstrap dependencies for fts-libgenom3-1.0 => Installing /opt/robotpkg/var/lib/robotpkg/packages/bsd/NetBSD-11-x86_64/All/digest-20080510.tgz => Installing /opt/robotpkg/var/lib/robotpkg/packages/bsd/NetBSD-11-x86_64/All/tnftp-20151004~ssl.tgz ===> Checking bootstrap dependencies for fts-libgenom3-1.0 => Required robotpkg package digest>=20080510: digest-20080510 found => Required robotpkg package tnftp>=20130505~ssl: tnftp-20151004~ssl found => Required system package gzip: gzip-20260107 found => Required system package pax and tar archivers: pax found => Required system package pkg_install>=20110805.12: pkg_install-20211115.4 found ===> Done bootstrap-depends for fts-libgenom3-1.0 ===> Installing full dependencies for fts-libgenom3-1.0 => Dependency digest-20080510 already installed => Installing /opt/robotpkg/var/lib/robotpkg/packages/bsd/NetBSD-11-x86_64/All/genom3-3.4.tgz => Installing /opt/robotpkg/var/lib/robotpkg/packages/bsd/NetBSD-11-x86_64/All/openrobots2-idl-2.3.2.tgz => Dependency tnftp-20151004~ssl already installed ===> Checking build options for fts-libgenom3-1.0 => Building with no option. ===> Checking alternatives for fts-libgenom3-1.0 => Use the GNU C++ compiler: c++-compiler provided by g++>=3 => Use the GNU C compiler: c-compiler provided by gcc>=3 ===> Checking dependencies for fts-libgenom3-1.0 => Required system package eigen3>=3.3: eigen3-3.4.0 found => Required system package g++>=3: g++-12.5.0 found => Required system package gcc>=3: gcc-12.5.0 found => Required system package libstdc++: libstdc++ found => Required system package pkg-config>=0.22: pkg-config-2.5.1 found => Required robotpkg package genom3>=3.4: genom3-3.4 found => Required robotpkg package openrobots2-idl>=2.0: openrobots2-idl-2.3.2 found ===> Done depends for fts-libgenom3-1.0 ===> Extracting for fts-libgenom3-1.0 => SHA1 checksums OK => RMD160 checksums OK x fts-libgenom3-1.0/ x fts-libgenom3-1.0/configure x fts-libgenom3-1.0/codels/ x fts-libgenom3-1.0/codels/calibration.cc x fts-libgenom3-1.0/codels/codels.h x fts-libgenom3-1.0/codels/fts_codels.c x fts-libgenom3-1.0/codels/fts_read_codels.c x fts-libgenom3-1.0/codels/Makefile.am x fts-libgenom3-1.0/codels/fts_c_types.h x fts-libgenom3-1.0/codels/Makefile.in x fts-libgenom3-1.0/configure.ac x fts-libgenom3-1.0/fts-libgenom3.pc.in x fts-libgenom3-1.0/Makefile.am x fts-libgenom3-1.0/fts.gen x fts-libgenom3-1.0/README.adoc x fts-libgenom3-1.0/autoconf/ x fts-libgenom3-1.0/autoconf/ltversion.m4 x fts-libgenom3-1.0/autoconf/lt~obsolete.m4 x fts-libgenom3-1.0/autoconf/ltsugar.m4 x fts-libgenom3-1.0/autoconf/compile x fts-libgenom3-1.0/autoconf/install-sh x fts-libgenom3-1.0/autoconf/ltoptions.m4 x fts-libgenom3-1.0/autoconf/depcomp x fts-libgenom3-1.0/autoconf/libtool.m4 x fts-libgenom3-1.0/autoconf/missing x fts-libgenom3-1.0/autoconf/config.sub x fts-libgenom3-1.0/autoconf/acfts.h.in x fts-libgenom3-1.0/autoconf/ltmain.sh x fts-libgenom3-1.0/autoconf/config.guess x fts-libgenom3-1.0/README.html x fts-libgenom3-1.0/aclocal.m4 x fts-libgenom3-1.0/Makefile.in ===> Configuring for fts-libgenom3-1.0 => Modifying GNU configure scripts to avoid --recheck => Disabling C++20 errors in GNU configure scripts configure: error: could not find GNU make An unexpected error occured. The last 10 log lines are shown below. | checking for /usr/bin/g++ option to produce PIC... -fPIC -DPIC | checking if /usr/bin/g++ PIC flag -fPIC -DPIC works... yes | checking if /usr/bin/g++ static flag -static works... yes | checking if /usr/bin/g++ supports -c -o file.o... yes | checking if /usr/bin/g++ supports -c -o file.o... (cached) yes | checking whether the /usr/bin/g++ linker (/usr/bin/ld) supports shared libraries... yes | checking dynamic linker characteristics... NetBSD ld.elf_so | checking how to hardcode library paths into programs... immediate | checking for library containing aio_write... -lrt | configure: error: could not find GNU make For details or bug reports, check the complete log file in: /local/robotpkg/var/tmp/robotpkg/interfaces/fts-libgenom3/work/configure.log gmake[3]: *** [/local/robotpkg/var/lib/robotpkg/mk/configure/configure.mk:250: do-configure-script(/local/robotpkg/var/tmp/robotpkg/interfaces/fts-libgenom3/work/fts-libgenom3-1.0)] Error 1 gmake[2]: *** [/local/robotpkg/var/lib/robotpkg/mk/pkg/package.mk:42: pkg-check-installed] Error 2 => Marking fts-libgenom3-1.0 as broken ERROR: /usr/pkg/bin/gmake: *** [package] Error 2 ===> Deinstalling for fts-libgenom3 Removed digest-20080510 Removing dependency eltclsh-1.21 Removing dependency Removed genom3-3.4 Removed openrobots2-idl-2.3.2 Removed tnftp-20151004~ssl