robotpkg/interfaces/camera-libgenom3 bulk build results
Log for camera-libgenom3-1.1 on Ubuntu-24.04-x86_64: build.log (Back)
--- Environment ---
_overrides_archivers_libarchive_PKGREQD=libarchive>=2.5.5 libarchive>=2.5.5 libarchive>=2.5.5
GENOM3=/opt/openrobots/bin/genom3
OPSYS=Ubuntu
LOWER_ARCH=x86_64
_override_vars_pkgtools_pkg_install=PKGREQD PKGREQD PKGREQD
PKGREPO2DEB=/local/robotpkg/sbin/pkgrepo2deb
LC_TIME=C
GZIP_CMD=/usr/bin/gzip
OS_KERNEL_VERSION=7.0.0-31-generic
BULKBASE=/opt/openrobots
OS_VERSION=24.04
ECHO_N=echo -n
_overrides_pkgtools_pkg_install_PKGREQD=pkg_install>=20110805.12 pkg_install>=20110805.12 pkg_install>=20110805.12
ROBOTPKG_BASE=/local/robotpkg
OLDPWD=/local/robotpkg/var/lib/robotpkg/hardware/libfranka
_override_vars_archivers_zlib=PKGREQD PKGREQD PKGREQD
_override_vars_architecture_genom3=PKGREQD PKGREQD PKGREQD
BZIP2_CMD=/usr/bin/bzip2
_override_vars_pkgtools_tnftp=PKGREQD PKGREQD
_overrides_pkgtools_tnftp_PKGREQD=tnftp>=20130505~ssl tnftp>=20130505~ssl
MACHINE_ARCH=x86_64
hline="$bf======================================================================$rm"
_overrides_archivers_zlib_PKGREQD=zlib>=1.2.3 zlib>=1.2.3 zlib>=1.2.3
_overrides_architecture_genom3_PKGREQD=genom3>=2.99.46 genom3>=2.99.46 genom3>=2.99.46
PKG_DBDIR=/opt/openrobots/var/db/robotpkg
FC=false
EXPECT_TARGETS=package
LC_MONETARY=C
LC_CTYPE=C
PKG_CONFIG=/usr/bin/pkg-config
MAKEFLAGS= --no-print-directory -- PKGREQD.cmdline=camera-libgenom3-1.1~!doc RECURSIVE_PKGPATH=interfaces/camera-libgenom3\ tag=Ubuntu-24.04-x86_64 BULK_LOGDIR=/local/robotpkg/var/log/bulk BULKBASE=/opt/openrobots LOCALBASE=/opt/openrobots PKG_DBDIR=/opt/openrobots/var/db/robotpkg EXPECT_TARGETS=package
LOWER_OPSYS=ubuntu
CPP=/usr/bin/gcc -E
_override_vars_pkgtools_digest=PKGREQD PKGREQD
bf=
_override_vars_pkgtools_pkgrepo2deb=PKGREQD PKGREQD
_override_vars_interfaces_openrobots2_idl=PKGREQD PKGREQD PKGREQD
_overrides_pkgtools_digest_PKGREQD=digest>=20080510 digest>=20080510
TAR=/usr/bin/tar
DIGEST=/opt/openrobots/sbin/robotpkg_digest
MACHINE_KERNEL=Linux-7.0.0-31-generic-x86_64
GCC=/usr/bin/gcc
LOWER_OS_VERSION=24.04
_overrides_pkgtools_pkgrepo2deb_PKGREQD=pkgrepo2deb>=1.9 pkgrepo2deb>=1.9
_overrides_interfaces_openrobots2_idl_PKGREQD=openrobots2-idl>=2.3.2 openrobots2-idl>=2.3.2 openrobots2-idl>=2.3.2
OWNER_GID=robots
PKGTOOLS_VERSION=20211115.4
PKG_CONFIG_PATH=/opt/openrobots/lib/pkgconfig
RECURSIVE_PKGPATH=interfaces/camera-libgenom3
GXX=/usr/bin/g++
MAKECONF=/opt/robotpkg/etc/robotpkg.conf
rm=
_override_vars_archivers_pax=PKGREQD PKGREQD
_override_vars_image_opencv4=PKGREQD PKGREQD PKGREQD
ROBOTPKG_TRUSTED_ENV=robotpkg
LC_COLLATE=C
OS_KERNEL=Linux
PATH=/usr/local/sbin:/usr/local/bin:/usr/sbin:/usr/bin:/snap/bin
_overrides_image_opencv4_PKGREQD=opencv4>=4<5 opencv4>=4<5 opencv4>=4<5
CXXCPP=/usr/bin/g++ -E
_overrides_archivers_pax_PKGREQD=pax pax
_override_vars_archivers_bzip2=PKGREQD PKGREQD PKGREQD
MAKELEVEL=4
DEB_HOST_MULTIARCH=x86_64-linux-gnu
MACHINE_PLATFORM=Ubuntu-24.04-x86_64
_overrides_archivers_bzip2_PKGREQD=bzip2 bzip2 bzip2
ROBOTPKG_DIR=/local/robotpkg/var/lib/robotpkg
LANG=C
TNFTP=/opt/openrobots/sbin/tnftp
MAKEOVERRIDES=${-*-command-variables-*-}
_override_vars_interfaces_camera_libgenom3=PKGREQD
LC_MESSAGES=C
tag=Ubuntu-24.04-x86_64
_overrides_interfaces_camera_libgenom3_PKGREQD=camera-libgenom3-1.1~!doc
CXX=/usr/bin/g++
LOCALBASE=/opt/openrobots
OWNER_UID=rbulk
BULK_LOGDIR=/local/robotpkg/var/log/bulk
ZCAT=/usr/bin/zcat
PAX=/usr/bin/pax
LOWER_OS_KERNEL=linux
GPG=/usr/bin/gpg --homedir=/opt/robotpkg/etc/gnupg
PWD=/local/robotpkg/var/lib/robotpkg/interfaces/camera-libgenom3
LC_NUMERIC=C
_ROBOTPKG_NOW=0922024906
MFLAGS=--no-print-directory
CC=/usr/bin/gcc
_override_vars_archivers_libarchive=PKGREQD PKGREQD PKGREQD
PKG_CONFIG_LIBDIR=/usr/lib/x86_64-linux-gnu/pkgconfig:/usr/lib/pkgconfig:/usr/share/pkgconfig
NODENAME=hydra64-ubuntu2404
---
Running set -e; cd /local/robotpkg/var/tmp/robotpkg/interfaces/camera-libgenom3/work/camera-libgenom3-1.1 && cd '/local/robotpkg/var/tmp/robotpkg/interfaces/camera-libgenom3/work/camera-libgenom3-1.1' && /usr/bin/env MAKE=make MAKELEVEL= 'CPPFLAGS=' 'CFLAGS=-pipe -O3 -DNDEBUG' 'LDFLAGS=' 'CXXFLAGS=-pipe -O3 -DNDEBUG' PREFIX='/opt/openrobots' HOME=/local/robotpkg/var/tmp/robotpkg/interfaces/camera-libgenom3/work PATH='/opt/openrobots/bin:/opt/openrobots/sbin:/usr/local/sbin:/usr/local/bin:/usr/sbin:/usr/bin:/snap/bin' LD_LIBRARY_PATH='' LOCALBASE=/opt/openrobots PKGMANDIR=man make -j4 -f Makefile all
Making all in codels
make[1]: Entering directory '/local/robotpkg/var/tmp/robotpkg/interfaces/camera-libgenom3/work/camera-libgenom3-1.1/codels'
make all-am
make[2]: Entering directory '/local/robotpkg/var/tmp/robotpkg/interfaces/camera-libgenom3/work/camera-libgenom3-1.1/codels'
/bin/sh ../libtool --tag=CXX --mode=compile /usr/bin/g++ -DHAVE_CONFIG_H -I. -I../autoconf -I/opt/openrobots/share/idl/openrobots2-idl -I/opt/openrobots/include -I/usr/include/opencv4 -pipe -O3 -DNDEBUG -MT libcamera_codels_la-camera_codels.lo -MD -MP -MF .deps/libcamera_codels_la-camera_codels.Tpo -c -o libcamera_codels_la-camera_codels.lo `test -f 'camera_codels.cc' || echo './'`camera_codels.cc
/bin/sh ../libtool --tag=CXX --mode=compile /usr/bin/g++ -DHAVE_CONFIG_H -I. -I../autoconf -I/opt/openrobots/share/idl/openrobots2-idl -I/opt/openrobots/include -I/usr/include/opencv4 -pipe -O3 -DNDEBUG -MT libcamera_codels_la-camera_worker_codels.lo -MD -MP -MF .deps/libcamera_codels_la-camera_worker_codels.Tpo -c -o libcamera_codels_la-camera_worker_codels.lo `test -f 'camera_worker_codels.cc' || echo './'`camera_worker_codels.cc
/bin/sh ../libtool --tag=CXX --mode=compile /usr/bin/g++ -DHAVE_CONFIG_H -I. -I../autoconf -I/opt/openrobots/share/idl/openrobots2-idl -I/opt/openrobots/include -I/usr/include/opencv4 -pipe -O3 -DNDEBUG -MT libcamera_codels_la-job.lo -MD -MP -MF .deps/libcamera_codels_la-job.Tpo -c -o libcamera_codels_la-job.lo `test -f 'job.cc' || echo './'`job.cc
/bin/sh ../libtool --tag=CXX --mode=compile /usr/bin/g++ -DHAVE_CONFIG_H -I. -I../autoconf -I/opt/openrobots/share/idl/openrobots2-idl -I/opt/openrobots/include -I/usr/include/opencv4 -pipe -O3 -DNDEBUG -MT libcamera_codels_la-pipeline.lo -MD -MP -MF .deps/libcamera_codels_la-pipeline.Tpo -c -o libcamera_codels_la-pipeline.lo `test -f 'pipeline.cc' || echo './'`pipeline.cc
libtool: compile: /usr/bin/g++ -DHAVE_CONFIG_H -I. -I../autoconf -I/opt/openrobots/share/idl/openrobots2-idl -I/opt/openrobots/include -I/usr/include/opencv4 -pipe -O3 -DNDEBUG -MT libcamera_codels_la-camera_codels.lo -MD -MP -MF .deps/libcamera_codels_la-camera_codels.Tpo -c camera_codels.cc -fPIC -DPIC -o .libs/libcamera_codels_la-camera_codels.o
libtool: compile: /usr/bin/g++ -DHAVE_CONFIG_H -I. -I../autoconf -I/opt/openrobots/share/idl/openrobots2-idl -I/opt/openrobots/include -I/usr/include/opencv4 -pipe -O3 -DNDEBUG -MT libcamera_codels_la-camera_worker_codels.lo -MD -MP -MF .deps/libcamera_codels_la-camera_worker_codels.Tpo -c camera_worker_codels.cc -fPIC -DPIC -o .libs/libcamera_codels_la-camera_worker_codels.o
libtool: compile: /usr/bin/g++ -DHAVE_CONFIG_H -I. -I../autoconf -I/opt/openrobots/share/idl/openrobots2-idl -I/opt/openrobots/include -I/usr/include/opencv4 -pipe -O3 -DNDEBUG -MT libcamera_codels_la-job.lo -MD -MP -MF .deps/libcamera_codels_la-job.Tpo -c job.cc -fPIC -DPIC -o .libs/libcamera_codels_la-job.o
libtool: compile: /usr/bin/g++ -DHAVE_CONFIG_H -I. -I../autoconf -I/opt/openrobots/share/idl/openrobots2-idl -I/opt/openrobots/include -I/usr/include/opencv4 -pipe -O3 -DNDEBUG -MT libcamera_codels_la-pipeline.lo -MD -MP -MF .deps/libcamera_codels_la-pipeline.Tpo -c pipeline.cc -fPIC -DPIC -o .libs/libcamera_codels_la-pipeline.o
In file included from camera_worker_codels.cc:34:
/home/mallet/src/camera-libgenom3/camera.gen: In function 'const genom_event_info* camera_einval(const camera_einval_detail*, genom_context)':
/home/mallet/src/camera-libgenom3/camera.gen:118:21: error: cannot convert 'const char*' to 'genom_event' {aka 'const genom_event_info*'} in argument passing
/home/mallet/src/camera-libgenom3/camera.gen: In function 'const genom_event_info* camera_eio(const camera_eio_detail*, genom_context)':
/home/mallet/src/camera-libgenom3/camera.gen:119:21: error: cannot convert 'const char*' to 'genom_event' {aka 'const genom_event_info*'} in argument passing
In file included from codels.hh:35,
from job.cc:30:
/home/mallet/src/camera-libgenom3/camera.gen: In function 'const genom_event_info* camera_einval(const camera_einval_detail*, genom_context)':
/home/mallet/src/camera-libgenom3/camera.gen:118:21: error: cannot convert 'const char*' to 'genom_event' {aka 'const genom_event_info*'} in argument passing
/home/mallet/src/camera-libgenom3/camera.gen: In function 'const genom_event_info* camera_eio(const camera_eio_detail*, genom_context)':
/home/mallet/src/camera-libgenom3/camera.gen:119:21: error: cannot convert 'const char*' to 'genom_event' {aka 'const genom_event_info*'} in argument passing
job.cc: In member function 'const genom_event_info* camera_job::status(camera_einval_detail&) const':
job.cc:55:10: error: cannot convert 'const char*' to 'genom_event' {aka 'const genom_event_info*'} in return
55 | return camera_einval_id;
| ^~~~~~~~~~~~~~~~
| |
| const char*
make[2]: *** [Makefile:544: libcamera_codels_la-job.lo] Error 1
make[2]: *** Waiting for unfinished jobs....
In file included from codels.hh:35,
from pipeline.cc:36:
/home/mallet/src/camera-libgenom3/camera.gen: In function 'const genom_event_info* camera_einval(const camera_einval_detail*, genom_context)':
/home/mallet/src/camera-libgenom3/camera.gen:118:21: error: cannot convert 'const char*' to 'genom_event' {aka 'const genom_event_info*'} in argument passing
/home/mallet/src/camera-libgenom3/camera.gen: In function 'const genom_event_info* camera_eio(const camera_eio_detail*, genom_context)':
/home/mallet/src/camera-libgenom3/camera.gen:119:21: error: cannot convert 'const char*' to 'genom_event' {aka 'const genom_event_info*'} in argument passing
camera_worker_codels.cc: In function 'const genom_event_info* camwrk_start(camera_worker*, genom_context)':
camera_worker_codels.cc:50:32: error: cannot convert 'const char*' to 'genom_event' {aka 'const genom_event_info*'} in return
50 | if (worker->pipeline) return camera_poll;
| ^~~~~~~~~~~
| |
| const char*
camera_worker_codels.cc:53:10: error: cannot convert 'const char*' to 'genom_event' {aka 'const genom_event_info*'} in return
53 | return camera_poll;
| ^~~~~~~~~~~
| |
| const char*
camera_worker_codels.cc: In function 'const genom_event_info* camwrk_poll(const camera_pipeline*, camera_pub**, camera_job**, genom_context)':
camera_worker_codels.cc:67:25: error: cannot convert 'const char*' to 'genom_event' {aka 'const genom_event_info*'} in return
67 | if (!pipeline) return camera_ether;
| ^~~~~~~~~~~~
| |
| const char*
camera_worker_codels.cc:70:22: error: cannot convert 'const char*' to 'genom_event' {aka 'const genom_event_info*'} in return
70 | if (*pub) return camera_publish;
| ^~~~~~~~~~~~~~
| |
| const char*
camera_worker_codels.cc:71:22: error: cannot convert 'const char*' to 'genom_event' {aka 'const genom_event_info*'} in return
71 | if (*job) return camera_process;
| ^~~~~~~~~~~~~~
| |
| const char*
camera_worker_codels.cc:74:10: error: cannot convert 'const char*' to 'genom_event' {aka 'const genom_event_info*'} in return
74 | return camera_poll;
| ^~~~~~~~~~~
| |
| const char*
camera_worker_codels.cc: In function 'const genom_event_info* camwrk_process(const camera_pipeline*, uint16_t*, camera_job**, genom_context)':
camera_worker_codels.cc:87:25: error: cannot convert 'const char*' to 'genom_event' {aka 'const genom_event_info*'} in return
87 | if (!pipeline) return camera_poll;
| ^~~~~~~~~~~
| |
| const char*
camera_worker_codels.cc:91:10: error: cannot convert 'const char*' to 'genom_event' {aka 'const genom_event_info*'} in return
91 | return camera_poll;
| ^~~~~~~~~~~
| |
| const char*
camera_worker_codels.cc: In function 'const genom_event_info* camwrk_publish(const camera_pipeline*, uint16_t*, camera_pub**, const camera_image*, genom_context)':
camera_worker_codels.cc:106:28: error: cannot convert 'const char*' to 'genom_event' {aka 'const genom_event_info*'} in return
106 | if (port == NULL) return camera_poll;
| ^~~~~~~~~~~
| |
| const char*
camera_worker_codels.cc:107:25: error: cannot convert 'const char*' to 'genom_event' {aka 'const genom_event_info*'} in return
107 | if (!pipeline) return camera_poll;
| ^~~~~~~~~~~
| |
| const char*
camera_worker_codels.cc:114:10: error: cannot convert 'const char*' to 'genom_event' {aka 'const genom_event_info*'} in return
114 | return camera_poll;
| ^~~~~~~~~~~
| |
| const char*
camera_worker_codels.cc: In function 'const genom_event_info* camwrk_stop(camera_worker*, genom_context)':
camera_worker_codels.cc:127:33: error: cannot convert 'const char*' to 'genom_event' {aka 'const genom_event_info*'} in return
127 | if (!worker->pipeline) return camera_ether;
| ^~~~~~~~~~~~
| |
| const char*
camera_worker_codels.cc:131:10: error: cannot convert 'const char*' to 'genom_event' {aka 'const genom_event_info*'} in return
131 | return camera_ether;
| ^~~~~~~~~~~~
| |
| const char*
camera_worker_codels.cc: In function 'const genom_event_info* camact_publish(const camera_pipeline*, const camera_worker_lock*, const char*, const char*, uint8_t, const camera_image*, genom_context)':
camera_worker_codels.cc:179:10: error: cannot convert 'const char*' to 'genom_event' {aka 'const genom_event_info*'} in return
179 | return camera_ether;
| ^~~~~~~~~~~~
| |
| const char*
camera_worker_codels.cc: In function 'const genom_event_info* camact_unpublish(const camera_pipeline*, const camera_worker_lock*, const char*, uint8_t, const camera_image*, genom_context)':
camera_worker_codels.cc:211:10: error: cannot convert 'const char*' to 'genom_event' {aka 'const genom_event_info*'} in return
211 | return camera_ether;
| ^~~~~~~~~~~~
| |
| const char*
make[2]: *** [Makefile:537: libcamera_codels_la-camera_worker_codels.lo] Error 1
make[2]: *** [Makefile:551: libcamera_codels_la-pipeline.lo] Error 1
In file included from camera_codels.cc:35:
/home/mallet/src/camera-libgenom3/camera.gen: In function 'const genom_event_info* camera_einval(const camera_einval_detail*, genom_context)':
/home/mallet/src/camera-libgenom3/camera.gen:118:21: error: cannot convert 'const char*' to 'genom_event' {aka 'const genom_event_info*'} in argument passing
/home/mallet/src/camera-libgenom3/camera.gen: In function 'const genom_event_info* camera_eio(const camera_eio_detail*, genom_context)':
/home/mallet/src/camera-libgenom3/camera.gen:119:21: error: cannot convert 'const char*' to 'genom_event' {aka 'const genom_event_info*'} in argument passing
camera_codels.cc: In function 'const genom_event_info* camfcn_status(const camera_worker_lock*, const char*, genom_context)':
camera_codels.cc:576:56: error: invalid conversion from 'long unsigned int' to 'genom_context' {aka 'const genom_context_iface*'} [-fpermissive]
576 | return e == genom_ok ? genom_ok : self->raise(e, &d, sizeof(d), self);
| ^~~~~~~~~
| |
| long unsigned int
camera_codels.cc:576:48: error: too many arguments to function
576 | return e == genom_ok ? genom_ok : self->raise(e, &d, sizeof(d), self);
| ~~~~~~~~~~~^~~~~~~~~~~~~~~~~~~~~~~~
make[2]: *** [Makefile:530: libcamera_codels_la-camera_codels.lo] Error 1
make[1]: *** [Makefile:418: all] Error 2
make[2]: Leaving directory '/local/robotpkg/var/tmp/robotpkg/interfaces/camera-libgenom3/work/camera-libgenom3-1.1/codels'
make[1]: Leaving directory '/local/robotpkg/var/tmp/robotpkg/interfaces/camera-libgenom3/work/camera-libgenom3-1.1/codels'
make: *** [Makefile:601: all-recursive] Error 1