robotpkg/interfaces/camera-libgenom3 bulk build results
Log for camera-libgenom3-1.1 on Rocky-8-x86_64: build.log (Back)
--- Environment ---
tag=Rocky-8-x86_64
BZIP2_CMD=/usr/bin/bzip2
PKG_CONFIG=/usr/bin/pkg-config
LC_MONETARY=C
LOWER_OPSYS=rocky
LANG=C
OS_VERSION=8
PKGTOOLS_VERSION=20211115.4
_override_vars_archivers_pax=PKGREQD PKGREQD
RPM_ARCH=x86_64
BULK_LOGDIR=/local/robotpkg/var/log/bulk
GXX=/usr/bin/g++
OLDPWD=/local/robotpkg/var/lib/robotpkg/graphics/sdformat
TAR=/usr/bin/tar
MACHINE_KERNEL=Linux-4.18.0-553.164.1.el8_10.x86_64-x86_64
PKG_CONFIG_LIBDIR=/usr/lib64/pkgconfig:/usr/share/pkgconfig
_override_vars_archivers_bzip2=PKGREQD PKGREQD PKGREQD
_override_vars_pkgtools_digest=PKGREQD PKGREQD
RPM_PACKAGE_RELEASE=
_overrides_image_opencv3_PKGREQD=opencv3>=3<4 opencv3>=3<4 opencv3>=3<4
OWNER_GID=robots
TNFTP=/opt/openrobots/sbin/tnftp
MAKECONF=/opt/robotpkg/etc/robotpkg.conf
GENOM3=/opt/openrobots/bin/genom3
_overrides_archivers_zlib_PKGREQD=zlib>=1.2.3 zlib>=1.2.3 zlib>=1.2.3
_overrides_archivers_pax_PKGREQD=pax pax
_overrides_pkgtools_tnftp_PKGREQD=tnftp>=20130505~ssl tnftp>=20130505~ssl
MFLAGS=--no-print-directory
_override_vars_interfaces_openrobots2_idl=PKGREQD PKGREQD PKGREQD
EXPECT_TARGETS=package
CC=/usr/bin/gcc
_overrides_interfaces_camera_libgenom3_PKGREQD=camera-libgenom3-1.1~!doc
ROBOTPKG_DIR=/local/robotpkg/var/lib/robotpkg
LC_COLLATE=C
ROBOTPKG_BASE=/local/robotpkg
MACHINE_PLATFORM=Rocky-8-x86_64
PWD=/local/robotpkg/var/lib/robotpkg/interfaces/camera-libgenom3
RPM_PACKAGE_VERSION=
LC_CTYPE=C
NODENAME=hydra64-rocky8.laas.fr
OS_KERNEL_VERSION=4.18.0-553.164.1.el8_10.x86_64
PKG_DBDIR=/opt/openrobots/var/db/robotpkg
RECURSIVE_PKGPATH=interfaces/camera-libgenom3
LOWER_OS_KERNEL=linux
PAX=/usr/bin/pax
OPSYS=Rocky
_ROBOTPKG_NOW=0922025540
_overrides_pkgtools_digest_PKGREQD=digest>=20080510 digest>=20080510
bf=
_override_vars_archivers_zlib=PKGREQD PKGREQD PKGREQD
_overrides_archivers_libarchive_PKGREQD=libarchive>=2.5.5 libarchive>=2.5.5 libarchive>=2.5.5
LC_NUMERIC=C
OWNER_UID=rbulk
_override_vars_pkgtools_tnftp=PKGREQD PKGREQD
FC=false
MACHINE_ARCH=x86_64
ECHO_N=echo -n
BULKBASE=/opt/openrobots
hline="$bf======================================================================$rm"
_override_vars_architecture_genom3=PKGREQD PKGREQD PKGREQD
_override_vars_pkgtools_pkg_install=PKGREQD PKGREQD PKGREQD
CXX=/usr/bin/g++
_overrides_architecture_genom3_PKGREQD=genom3>=2.99.46 genom3>=2.99.46 genom3>=2.99.46
LOCALBASE=/opt/openrobots
MAKEOVERRIDES=${-*-command-variables-*-}
LC_MESSAGES=C
_overrides_pkgtools_pkg_install_PKGREQD=pkg_install>=20110805.12 pkg_install>=20110805.12 pkg_install>=20110805.12
_override_vars_interfaces_camera_libgenom3=PKGREQD
GZIP_CMD=/usr/bin/gzip
RPM_PACKAGE_NAME=robotpkg-camera-libgenom3
MAKELEVEL=4
rm=
SHLVL=4
LOWER_ARCH=x86_64
_overrides_archivers_bzip2_PKGREQD=bzip2 bzip2 bzip2
ZCAT=/usr/bin/zcat
DIGEST=/opt/openrobots/sbin/robotpkg_digest
_overrides_interfaces_openrobots2_idl_PKGREQD=openrobots2-idl>=2.3.2 openrobots2-idl>=2.3.2 openrobots2-idl>=2.3.2
_override_vars_archivers_libarchive=PKGREQD PKGREQD PKGREQD
CXXCPP=/usr/bin/g++ -E
LOWER_OS_VERSION=8
PATH=/usr/local/sbin:/usr/local/bin:/usr/sbin:/usr/bin
ROBOTPKG_TRUSTED_ENV=robotpkg
_override_vars_image_opencv3=PKGREQD PKGREQD PKGREQD
GCC=/usr/bin/gcc
PKG_CONFIG_PATH=/opt/openrobots/lib/pkgconfig
MAKEFLAGS= --no-print-directory -- PKGREQD.cmdline=camera-libgenom3-1.1~!doc RECURSIVE_PKGPATH=interfaces/camera-libgenom3\ tag=Rocky-8-x86_64 BULK_LOGDIR=/local/robotpkg/var/log/bulk BULKBASE=/opt/openrobots LOCALBASE=/opt/openrobots PKG_DBDIR=/opt/openrobots/var/db/robotpkg EXPECT_TARGETS=package
OS_KERNEL=Linux
CPP=/usr/bin/gcc -E
LC_TIME=C
_=/usr/bin/env
---
Running set -e; cd /local/robotpkg/var/tmp/robotpkg/interfaces/camera-libgenom3/work/camera-libgenom3-1.1 && cd '/local/robotpkg/var/tmp/robotpkg/interfaces/camera-libgenom3/work/camera-libgenom3-1.1' && /usr/bin/env MAKE=make MAKELEVEL= 'CPPFLAGS=' 'CFLAGS=-pipe -O3 -DNDEBUG' 'LDFLAGS=' 'CXXFLAGS=-pipe -O3 -DNDEBUG' PREFIX='/opt/openrobots' HOME=/local/robotpkg/var/tmp/robotpkg/interfaces/camera-libgenom3/work PATH='/opt/openrobots/bin:/opt/openrobots/sbin:/usr/local/sbin:/usr/local/bin:/usr/sbin:/usr/bin' LD_LIBRARY_PATH='' LOCALBASE=/opt/openrobots PKGMANDIR=man make -j4 -f Makefile all
Making all in codels
make[1]: Entering directory '/local/robotpkg/var/tmp/robotpkg/interfaces/camera-libgenom3/work/camera-libgenom3-1.1/codels'
make all-am
make[2]: Entering directory '/local/robotpkg/var/tmp/robotpkg/interfaces/camera-libgenom3/work/camera-libgenom3-1.1/codels'
/bin/sh ../libtool --tag=CXX --mode=compile /usr/bin/g++ -DHAVE_CONFIG_H -I. -I../autoconf -I/opt/openrobots/share/idl/openrobots2-idl -I/opt/openrobots/include -I/usr/include/opencv -pipe -O3 -DNDEBUG -MT libcamera_codels_la-camera_codels.lo -MD -MP -MF .deps/libcamera_codels_la-camera_codels.Tpo -c -o libcamera_codels_la-camera_codels.lo `test -f 'camera_codels.cc' || echo './'`camera_codels.cc
/bin/sh ../libtool --tag=CXX --mode=compile /usr/bin/g++ -DHAVE_CONFIG_H -I. -I../autoconf -I/opt/openrobots/share/idl/openrobots2-idl -I/opt/openrobots/include -I/usr/include/opencv -pipe -O3 -DNDEBUG -MT libcamera_codels_la-camera_worker_codels.lo -MD -MP -MF .deps/libcamera_codels_la-camera_worker_codels.Tpo -c -o libcamera_codels_la-camera_worker_codels.lo `test -f 'camera_worker_codels.cc' || echo './'`camera_worker_codels.cc
/bin/sh ../libtool --tag=CXX --mode=compile /usr/bin/g++ -DHAVE_CONFIG_H -I. -I../autoconf -I/opt/openrobots/share/idl/openrobots2-idl -I/opt/openrobots/include -I/usr/include/opencv -pipe -O3 -DNDEBUG -MT libcamera_codels_la-job.lo -MD -MP -MF .deps/libcamera_codels_la-job.Tpo -c -o libcamera_codels_la-job.lo `test -f 'job.cc' || echo './'`job.cc
/bin/sh ../libtool --tag=CXX --mode=compile /usr/bin/g++ -DHAVE_CONFIG_H -I. -I../autoconf -I/opt/openrobots/share/idl/openrobots2-idl -I/opt/openrobots/include -I/usr/include/opencv -pipe -O3 -DNDEBUG -MT libcamera_codels_la-pipeline.lo -MD -MP -MF .deps/libcamera_codels_la-pipeline.Tpo -c -o libcamera_codels_la-pipeline.lo `test -f 'pipeline.cc' || echo './'`pipeline.cc
libtool: compile: /usr/bin/g++ -DHAVE_CONFIG_H -I. -I../autoconf -I/opt/openrobots/share/idl/openrobots2-idl -I/opt/openrobots/include -I/usr/include/opencv -pipe -O3 -DNDEBUG -MT libcamera_codels_la-camera_codels.lo -MD -MP -MF .deps/libcamera_codels_la-camera_codels.Tpo -c camera_codels.cc -fPIC -DPIC -o .libs/libcamera_codels_la-camera_codels.o
libtool: compile: /usr/bin/g++ -DHAVE_CONFIG_H -I. -I../autoconf -I/opt/openrobots/share/idl/openrobots2-idl -I/opt/openrobots/include -I/usr/include/opencv -pipe -O3 -DNDEBUG -MT libcamera_codels_la-camera_worker_codels.lo -MD -MP -MF .deps/libcamera_codels_la-camera_worker_codels.Tpo -c camera_worker_codels.cc -fPIC -DPIC -o .libs/libcamera_codels_la-camera_worker_codels.o
libtool: compile: /usr/bin/g++ -DHAVE_CONFIG_H -I. -I../autoconf -I/opt/openrobots/share/idl/openrobots2-idl -I/opt/openrobots/include -I/usr/include/opencv -pipe -O3 -DNDEBUG -MT libcamera_codels_la-job.lo -MD -MP -MF .deps/libcamera_codels_la-job.Tpo -c job.cc -fPIC -DPIC -o .libs/libcamera_codels_la-job.o
libtool: compile: /usr/bin/g++ -DHAVE_CONFIG_H -I. -I../autoconf -I/opt/openrobots/share/idl/openrobots2-idl -I/opt/openrobots/include -I/usr/include/opencv -pipe -O3 -DNDEBUG -MT libcamera_codels_la-pipeline.lo -MD -MP -MF .deps/libcamera_codels_la-pipeline.Tpo -c pipeline.cc -fPIC -DPIC -o .libs/libcamera_codels_la-pipeline.o
In file included from camera_worker_codels.cc:34:
/home/mallet/src/camera-libgenom3/camera.gen: In function 'const genom_event_info* camera_einval(const camera_einval_detail*, genom_context)':
/home/mallet/src/camera-libgenom3/camera.gen:118:58: error: cannot convert 'const char*' to 'genom_event' {aka 'const genom_event_info*'} in argument passing
In file included from camera_worker_codels.cc:34:
/home/mallet/src/camera-libgenom3/camera.gen: In function 'const genom_event_info* camera_eio(const camera_eio_detail*, genom_context)':
/home/mallet/src/camera-libgenom3/camera.gen:119:55: error: cannot convert 'const char*' to 'genom_event' {aka 'const genom_event_info*'} in argument passing
In file included from codels.hh:35,
from job.cc:30:
/home/mallet/src/camera-libgenom3/camera.gen: In function 'const genom_event_info* camera_einval(const camera_einval_detail*, genom_context)':
/home/mallet/src/camera-libgenom3/camera.gen:118:58: error: cannot convert 'const char*' to 'genom_event' {aka 'const genom_event_info*'} in argument passing
In file included from codels.hh:35,
from job.cc:30:
/home/mallet/src/camera-libgenom3/camera.gen: In function 'const genom_event_info* camera_eio(const camera_eio_detail*, genom_context)':
/home/mallet/src/camera-libgenom3/camera.gen:119:55: error: cannot convert 'const char*' to 'genom_event' {aka 'const genom_event_info*'} in argument passing
In file included from codels.hh:35,
from pipeline.cc:36:
/home/mallet/src/camera-libgenom3/camera.gen: In function 'const genom_event_info* camera_einval(const camera_einval_detail*, genom_context)':
/home/mallet/src/camera-libgenom3/camera.gen:118:58: error: cannot convert 'const char*' to 'genom_event' {aka 'const genom_event_info*'} in argument passing
In file included from codels.hh:35,
from pipeline.cc:36:
/home/mallet/src/camera-libgenom3/camera.gen: In function 'const genom_event_info* camera_eio(const camera_eio_detail*, genom_context)':
/home/mallet/src/camera-libgenom3/camera.gen:119:55: error: cannot convert 'const char*' to 'genom_event' {aka 'const genom_event_info*'} in argument passing
job.cc: In member function 'const genom_event_info* camera_job::status(camera_einval_detail&) const':
job.cc:55:10: error: cannot convert 'const char*' to 'genom_event' {aka 'const genom_event_info*'} in return
return camera_einval_id;
^~~~~~~~~~~~~~~~
camera_worker_codels.cc: In function 'const genom_event_info* camwrk_start(camera_worker*, genom_context)':
camera_worker_codels.cc:50:32: error: cannot convert 'const char*' to 'genom_event' {aka 'const genom_event_info*'} in return
if (worker->pipeline) return camera_poll;
^~~~~~~~~~~
camera_worker_codels.cc:53:10: error: cannot convert 'const char*' to 'genom_event' {aka 'const genom_event_info*'} in return
return camera_poll;
^~~~~~~~~~~
camera_worker_codels.cc: In function 'const genom_event_info* camwrk_poll(const camera_pipeline*, camera_pub**, camera_job**, genom_context)':
camera_worker_codels.cc:67:25: error: cannot convert 'const char*' to 'genom_event' {aka 'const genom_event_info*'} in return
if (!pipeline) return camera_ether;
^~~~~~~~~~~~
camera_worker_codels.cc:70:22: error: cannot convert 'const char*' to 'genom_event' {aka 'const genom_event_info*'} in return
if (*pub) return camera_publish;
^~~~~~~~~~~~~~
camera_worker_codels.cc:71:22: error: cannot convert 'const char*' to 'genom_event' {aka 'const genom_event_info*'} in return
if (*job) return camera_process;
^~~~~~~~~~~~~~
camera_worker_codels.cc:74:10: error: cannot convert 'const char*' to 'genom_event' {aka 'const genom_event_info*'} in return
return camera_poll;
^~~~~~~~~~~
camera_worker_codels.cc: In function 'const genom_event_info* camwrk_process(const camera_pipeline*, uint16_t*, camera_job**, genom_context)':
camera_worker_codels.cc:87:25: error: cannot convert 'const char*' to 'genom_event' {aka 'const genom_event_info*'} in return
if (!pipeline) return camera_poll;
^~~~~~~~~~~
camera_worker_codels.cc:91:10: error: cannot convert 'const char*' to 'genom_event' {aka 'const genom_event_info*'} in return
return camera_poll;
^~~~~~~~~~~
camera_worker_codels.cc: In function 'const genom_event_info* camwrk_publish(const camera_pipeline*, uint16_t*, camera_pub**, const camera_image*, genom_context)':
camera_worker_codels.cc:106:28: error: cannot convert 'const char*' to 'genom_event' {aka 'const genom_event_info*'} in return
if (port == NULL) return camera_poll;
^~~~~~~~~~~
camera_worker_codels.cc:107:25: error: cannot convert 'const char*' to 'genom_event' {aka 'const genom_event_info*'} in return
if (!pipeline) return camera_poll;
^~~~~~~~~~~
camera_worker_codels.cc:114:10: error: cannot convert 'const char*' to 'genom_event' {aka 'const genom_event_info*'} in return
return camera_poll;
^~~~~~~~~~~
camera_worker_codels.cc: In function 'const genom_event_info* camwrk_stop(camera_worker*, genom_context)':
camera_worker_codels.cc:127:33: error: cannot convert 'const char*' to 'genom_event' {aka 'const genom_event_info*'} in return
if (!worker->pipeline) return camera_ether;
^~~~~~~~~~~~
camera_worker_codels.cc:131:10: error: cannot convert 'const char*' to 'genom_event' {aka 'const genom_event_info*'} in return
return camera_ether;
^~~~~~~~~~~~
camera_worker_codels.cc: In function 'const genom_event_info* camact_publish(const camera_pipeline*, const camera_worker_lock*, const char*, const char*, uint8_t, const camera_image*, genom_context)':
camera_worker_codels.cc:179:10: error: cannot convert 'const char*' to 'genom_event' {aka 'const genom_event_info*'} in return
return camera_ether;
^~~~~~~~~~~~
camera_worker_codels.cc: In function 'const genom_event_info* camact_unpublish(const camera_pipeline*, const camera_worker_lock*, const char*, uint8_t, const camera_image*, genom_context)':
camera_worker_codels.cc:211:10: error: cannot convert 'const char*' to 'genom_event' {aka 'const genom_event_info*'} in return
return camera_ether;
^~~~~~~~~~~~
make[2]: *** [Makefile:537: libcamera_codels_la-camera_worker_codels.lo] Error 1
make[2]: *** Waiting for unfinished jobs....
make[2]: *** [Makefile:551: libcamera_codels_la-pipeline.lo] Error 1
make[2]: *** [Makefile:544: libcamera_codels_la-job.lo] Error 1
In file included from camera_codels.cc:35:
/home/mallet/src/camera-libgenom3/camera.gen: In function 'const genom_event_info* camera_einval(const camera_einval_detail*, genom_context)':
/home/mallet/src/camera-libgenom3/camera.gen:118:58: error: cannot convert 'const char*' to 'genom_event' {aka 'const genom_event_info*'} in argument passing
In file included from camera_codels.cc:35:
/home/mallet/src/camera-libgenom3/camera.gen: In function 'const genom_event_info* camera_eio(const camera_eio_detail*, genom_context)':
/home/mallet/src/camera-libgenom3/camera.gen:119:55: error: cannot convert 'const char*' to 'genom_event' {aka 'const genom_event_info*'} in argument passing
camera_codels.cc: In function 'const genom_event_info* camfcn_status(const camera_worker_lock*, const char*, genom_context)':
camera_codels.cc:576:56: error: invalid conversion from 'long unsigned int' to 'genom_context' {aka 'const genom_context_iface*'} [-fpermissive]
return e == genom_ok ? genom_ok : self->raise(e, &d, sizeof(d), self);
^~~~~~~~~
camera_codels.cc:576:71: error: too many arguments to function
return e == genom_ok ? genom_ok : self->raise(e, &d, sizeof(d), self);
^
make[2]: *** [Makefile:530: libcamera_codels_la-camera_codels.lo] Error 1
make[2]: Leaving directory '/local/robotpkg/var/tmp/robotpkg/interfaces/camera-libgenom3/work/camera-libgenom3-1.1/codels'
make[1]: Leaving directory '/local/robotpkg/var/tmp/robotpkg/interfaces/camera-libgenom3/work/camera-libgenom3-1.1/codels'
make[1]: *** [Makefile:418: all] Error 2
make: *** [Makefile:601: all-recursive] Error 1