robotpkg/wip/ur5-description bulk build results

Log for ur5-description-1.0.1 on CentOS-7-x86_64: bulk.log (Back)

=> Checking for clear installation ===> Installing bootstrap dependencies for ur5-description-1.0.1 Warning: the LICENSE of wip/ur5-description is undefined. => Installing /opt/robotpkg/var/lib/robotpkg/packages/bsd/CentOS-7-x86_64/All/digest-20080510.tgz => Installing /opt/robotpkg/var/lib/robotpkg/packages/bsd/CentOS-7-x86_64/All/tnftp-20130505~ssl.tgz Warning: the LICENSE of wip/ur5-description is undefined. ===> Checking bootstrap dependencies for ur5-description-1.0.1 => Required robotpkg package digest>=20080510: digest-20080510 found => Required robotpkg package tnftp>=20130505~ssl: tnftp-20130505~ssl found => Required system package gzip: gzip-1.5 found => Required system package pax and tar archivers: pax found => Required system package pkg_install>=20110805.9: pkg_install-20110805.9 found ===> Done bootstrap-depends for ur5-description-1.0.1 Warning: the LICENSE of wip/ur5-description is undefined. ===> Installing full dependencies for ur5-description-1.0.1 Warning: the LICENSE of wip/ur5-description is undefined. => Dependency digest-20080510 already installed => Dependency tnftp-20130505~ssl already installed Warning: the LICENSE of wip/ur5-description is undefined. ===> Checking build options for ur5-description-1.0.1 => Building with no option. ===> Checking alternatives for ur5-description-1.0.1 => Use the GNU C++ compiler: c++-compiler provided by g++>=3 => Use the GNU C compiler: c-compiler provided by gcc>=3 ===> Checking dependencies for ur5-description-1.0.1 => Required system package cmake>=2.6: cmake-2.8.12.2 found => Required system package g++>=3: g++-4.8.5 found => Required system package gcc>=3: gcc-4.8.5 found => Required system package libstdc++: libstdc++ found => Required system package pkg-config>=0.22: pkg-config-0.27.1 found ===> Done depends for ur5-description-1.0.1 Warning: the LICENSE of wip/ur5-description is undefined. Warning: the LICENSE of wip/ur5-description is undefined. Warning: the LICENSE of wip/ur5-description is undefined. ===> Extracting for ur5-description-1.0.1 => SHA1 checksums OK => RMD160 checksums OK ===> Configuring for ur5-description-1.0.1 -- Doxygen rendering: using LaTeX backend ===> Building for ur5-description-1.0.1 ===> Installing for ur5-description-1.0.1 Warning: the LICENSE of wip/ur5-description is undefined. => Adding run-time search paths to pkg-config files robotpkg_create: can't stat `/opt/openrobots/lib/pkgconfig/ur5_description.pc' => Registering installation for ur5-description-1.0.1 robotpkg_admin: ur5-description-1.0.1: File `/opt/openrobots/lib/pkgconfig/ur5_description.pc' is in +CONTENTS but not on filesystem! ===> Done install for ur5-description-1.0.1 ===> Building binary package for ur5-description-1.0.1 Warning: the LICENSE of wip/ur5-description is undefined. robotpkg_create: can't stat `/opt/openrobots/lib/pkgconfig/ur5_description.pc' Creating package /opt/robotpkg/var/lib/robotpkg/wip/packages/bsd/CentOS-7-x86_64/All/ur5-description-1.0.1 robotpkg_create: lstat failed for file lib/pkgconfig/ur5_description.pc: No such file or directory make[3]: *** [pkg-tarup] Error 2 Warning: the LICENSE of wip/ur5-description is undefined. ERROR: This package cannot be extracted for the following reason: ERROR: ====================================================================== ERROR: A lib64 directory may not exist in LOCALBASE. ERROR: Having a lib64 directory within the robotpkg installation ERROR: tree is not supported. Please remove ERROR: /opt/openrobots/lib64 ERROR: ERROR: ====================================================================== make[3]: *** [cbeh] Error 2 make[2]: *** [package-failed] Error 2 => Marking ur5-description-1.0.1 as broken ERROR: make: *** [package] Error 2 Warning: the LICENSE of wip/ur5-description is undefined. ===> Deinstalling for ur5-description robotpkg_delete: Couldn't remove /opt/openrobots/lib/pkgconfig/ur5_description.pc Removed ur5-description-1.0.1 Removed digest-20080510 Removed tnftp-20130505~ssl