robotpkg/wip/spark-genom bulk build results

spark-genom-3.9~mightability+openprs+tcl+tclserv_client (category knowledge or summary)

Platform Status Date Time Log files
Start Total brokenbrokenbybulkcbbhcbbhbyconfigureextract
CentOS-7-x86_64N/A2018/08/1720:14:2800:00:08ViewView
gts>=0.7
Debian-8-x86_64Broken2018/08/1719:29:3600:00:11
make: *** [package] Error 2
ViewViewView
Fedora-26-x86_64Broken2018/08/1719:57:1000:00:11
Required robotpkg package libmove3d>=3.22.0: BROKEN Required robotpkg package libmove3d-hri>=2.24: BROKEN Required robotpkg package viman-genom>=1.4: NOT found
View
Fedora-27-x86_64Broken2018/08/1720:15:3600:00:08
Required robotpkg package libmove3d>=3.22.0: BROKEN Required robotpkg package libmove3d-hri>=2.24: BROKEN Required robotpkg package viman-genom>=1.4: NOT found
View
NetBSD-7.1_STABLE-x86_64Broken2018/08/1719:47:1200:00:04
Required robotpkg package niut-genom>=0.6: NOT found Required robotpkg package viman-genom>=1.4: NOT found
View
OpenNao-2.1.0.19-i386N/A2018/08/1720:07:2700:00:10ViewView
glpk>=4.36
gsl>=1
gts>=0.7
Ubuntu-12.04-i386Broken2018/08/1719:30:5200:00:18
make: *** [package] Error 2
ViewViewView
Ubuntu-12.04-x86_64Broken2018/08/1719:28:5200:00:10
make: *** [package] Error 2
ViewViewView
Ubuntu-14.04-x86_64Broken2018/08/1719:29:0200:00:13
make: *** [package] Error 2
ViewViewView
Ubuntu-16.04-x86_64Broken2018/08/1719:29:1700:00:11
make: *** [package] Error 2
ViewViewView
Ubuntu-18.04-x86_64Broken2018/08/1719:49:5600:00:08
Required robotpkg package libmove3d>=3.22.0: BROKEN Required robotpkg package libmove3d-hri>=2.24: BROKEN Required robotpkg package viman-genom>=1.4: NOT found
View