robotpkg/wip/soth bulk build results

soth-2.0.4 (category wip or summary)

Platform Status Date Time Log files
Start Total brokenbulkcbbhcbbhbycmakeconfigureextractsysdep
Debian-11-x86_64N/A2026/09/ 902:37:3100:00:04ViewView
cmake>=3.22
Debian-12-x86_64Broken2026/09/ 912:42:1900:00:10
make: *** [package] Error 2
ViewViewViewView
Debian-13-x86_64Broken2026/09/ 909:26:3500:00:10
make: *** [package] Error 2
ViewViewViewView
Fedora-42-x86_64Broken2026/09/ 816:57:0000:00:11
make: *** [package] Error 2
ViewViewViewView
Fedora-44-x86_64Broken2026/09/ 906:37:3800:00:09
make: *** [package] Error 2
ViewViewViewView
NetBSD-10.0-x86_64Broken2026/09/ 910:36:0000:00:17
/usr/pkg/bin/gmake: *** [package] Error 2
ViewViewViewView
Rocky-8-x86_64Sysdep2026/09/ 906:20:0600:00:04ViewView
eigen3>=3.3
View
Ubuntu-20.04-x86_64N/A2026/09/ 903:10:5000:00:05ViewView
cmake>=3.22
Ubuntu-22.04-x86_64Broken2026/09/ 912:36:5500:00:13
make: *** [package] Error 2
ViewViewViewView
Ubuntu-24.04-x86_64Broken2026/09/ 911:26:2600:00:09
make: *** [package] Error 2
ViewViewViewView
Ubuntu-26.04-x86_64Broken2026/09/ 903:46:4500:00:06
make: *** [package] Error 2
ViewViewViewView