robotpkg/wip/rviz-plugin-covariance bulk build results

rviz-plugin-covariance-0.0.6os1r1 (category wip or summary)

Platform Status Date Time Log files
Start Total brokenbuildbulkcbbhcbbhbycmakeconfigureextractinstallplist
Debian-11-x86_64Broken2026/09/ 902:36:2600:00:08
make: *** [package] Error 2
ViewViewViewView
Debian-12-x86_64Broken2026/09/ 912:39:4600:00:09
make: *** [package] Error 2
ViewViewViewView
Debian-13-x86_64N/A2026/09/ 909:24:3900:00:04ViewView
py313-sip>=4<5
Fedora-42-x86_64Broken2026/09/ 817:36:1800:00:09
make: *** [package] Error 2
ViewViewViewView
Fedora-44-x86_64Broken2026/09/ 906:58:5000:00:05
Required robotpkg package ros-rviz>=1.9: NOT found
View
NetBSD-10.0-x86_64N/A2026/09/ 910:37:5900:00:06ViewView
libogre>=1.7
Rocky-8-x86_64N/A2026/09/ 906:50:3500:00:03ViewView
eigen3>=3.3
libogre>=1.7
poco>=1
Ubuntu-20.04-x86_64Broken2026/09/ 904:45:4500:00:32
make: *** [package] Error 2
ViewViewViewViewViewViewView
Ubuntu-22.04-x86_64Broken2026/09/ 912:34:0300:00:13
make: *** [package] Error 2
ViewViewViewView
Ubuntu-24.04-x86_64Broken2026/09/ 911:24:0300:00:10
make: *** [package] Error 2
ViewViewViewView
Ubuntu-26.04-x86_64N/A2026/09/ 903:46:1500:00:04ViewView
py314-sip>=4<5