robotpkg/wip/ros-warehouse-ros bulk build results

ros-warehouse-ros-0.9.2r1 (category wip or summary)

Platform Status Date Time Log files
Start Total brokenbuildbulkcbbhcbbhbycmakeconfigureextract
Debian-11-x86_64OK2026/09/1802:52:1900:00:30
Debian-12-x86_64OK2026/09/1807:27:4100:00:30
Debian-13-x86_64Broken2026/09/3021:44:1000:00:17
make: *** [package] Error 2
ViewViewViewViewView
Fedora-42-x86_64Broken2026/09/3021:43:2400:00:17
make: *** [package] Error 2
ViewViewViewViewView
Fedora-44-x86_64Broken2026/09/3021:13:1100:00:18
make: *** [package] Error 2
ViewViewViewViewView
NetBSD-11-x86_64Broken2026/09/3021:48:4200:00:21
/usr/pkg/bin/gmake: *** [package] Error 2
ViewViewViewViewView
Rocky-10-x86_64N/A2026/09/3021:05:5400:00:05ViewView
poco>=1
Rocky-8-x86_64N/A2026/09/3021:33:3700:00:08ViewView
poco>=1
Ubuntu-20.04-x86_64OK2026/09/2202:15:1100:00:40
Ubuntu-22.04-x86_64OK2026/09/1808:39:4000:00:41
Ubuntu-24.04-x86_64OK2026/09/1806:51:0000:00:33
Ubuntu-26.04-x86_64Broken2026/09/3021:17:2200:00:20
make: *** [package] Error 2
ViewViewViewViewView