robotpkg/wip/ros-qualisys bulk build results

ros-qualisys-1.0.0 (category wip or summary)

Platform Status Date Time Log files
Start Total brokenbulkcbbhcbbhbycmakeconfigureextract
Debian-11-x86_64N/A2026/09/3020:40:0200:00:04ViewView
cmake>=3.22
Debian-12-x86_64OK2026/09/1807:06:4500:00:27
Debian-13-x86_64OK2026/09/1805:05:2600:00:24
Fedora-42-x86_64OK2026/09/1809:03:2600:00:26
Fedora-44-x86_64Broken2026/09/3021:01:0900:00:08
make: *** [package] Error 2
ViewViewViewView
NetBSD-11-x86_64Broken2026/09/3021:55:3000:00:13
/usr/pkg/bin/gmake: *** [package] Error 2
ViewViewViewView
Rocky-10-x86_64N/A2026/09/3021:06:0000:00:06ViewView
poco>=1
Rocky-8-x86_64N/A2026/09/3021:31:4300:00:07ViewView
poco>=1
Ubuntu-20.04-x86_64N/A2026/09/3021:02:3900:00:14ViewView
cmake>=3.22
Ubuntu-22.04-x86_64OK2026/09/1807:25:4200:00:36
Ubuntu-24.04-x86_64OK2026/09/1806:49:3800:00:27
Ubuntu-26.04-x86_64Broken2026/09/3021:15:1900:00:12
make: *** [package] Error 2
ViewViewViewView