robotpkg/wip/ros-py-urdf-parser bulk build results

ros-py27-urdf-parser-0.4.0r1 (category wip or summary)

Platform Status Date Time Log files
Start Total bulkcbbhcbbhbysysdep
Debian-11-x86_64N/A2026/09/1802:50:0000:00:01ViewView
Debian-12-x86_64N/A2026/09/1807:23:3900:00:01ViewView
Debian-13-x86_64N/A2026/09/1805:14:4700:00:00ViewView
Fedora-42-x86_64N/A2026/09/1809:02:3500:00:01ViewView
Fedora-44-x86_64N/A2026/09/1808:07:2300:00:00ViewView
NetBSD-11-x86_64N/A2026/09/1811:53:3000:00:01ViewView
Rocky-10-x86_64N/A2026/09/1805:00:3700:00:00ViewView
Rocky-8-x86_64N/A2026/09/1801:23:5300:00:00ViewView
Ubuntu-20.04-x86_64Sysdep2026/09/2218:17:4300:00:06ViewView
py27-empy>=3
py27-pyparsing
View
Ubuntu-22.04-x86_64Sysdep2026/09/2218:21:4800:00:05ViewView
py27-empy>=3
py27-pyparsing
py27-yaml>=3
View
Ubuntu-24.04-x86_64N/A2026/09/1807:01:2900:00:01ViewView
Ubuntu-26.04-x86_64N/A2026/09/1805:18:0400:00:00ViewView

ros-py310-urdf-parser-0.4.0r1 (category wip or summary)

Platform Status Date Time Log files
Start Total brokenbuildbulkcbbhcmakeconfigureextractinstall
Debian-11-x86_64N/A2026/09/1802:50:0100:00:00ViewView
Debian-12-x86_64N/A2026/09/1807:23:4000:00:00ViewView
Debian-13-x86_64N/A2026/09/1805:14:4700:00:00ViewView
Fedora-42-x86_64N/A2026/09/1809:02:3600:00:00ViewView
Fedora-44-x86_64N/A2026/09/1808:07:2400:00:00ViewView
NetBSD-11-x86_64N/A2026/09/1811:53:3100:00:01ViewView
Rocky-10-x86_64N/A2026/09/1805:00:3800:00:00ViewView
Rocky-8-x86_64N/A2026/09/1801:23:5400:00:00ViewView
Ubuntu-20.04-x86_64N/A2026/09/2118:58:3700:00:01ViewView
Ubuntu-22.04-x86_64Broken2026/09/2218:21:3900:00:09
make: *** [package] Error 2
ViewViewViewViewViewView
Ubuntu-24.04-x86_64N/A2026/09/1807:01:3000:00:00ViewView
Ubuntu-26.04-x86_64N/A2026/09/1805:18:0500:00:00ViewView

ros-py311-urdf-parser-0.4.0r1 (category wip or summary)

Platform Status Date Time Log files
Start Total brokenbuildbulkcbbhcmakeconfigureextractinstall
Debian-11-x86_64N/A2026/09/1802:50:0100:00:00ViewView
Debian-12-x86_64Broken2026/09/2218:20:2300:00:09
make: *** [package] Error 2
ViewViewViewViewViewView
Debian-13-x86_64N/A2026/09/1805:14:4700:00:01ViewView
Fedora-42-x86_64N/A2026/09/1809:02:3700:00:00ViewView
Fedora-44-x86_64N/A2026/09/1808:07:2400:00:01ViewView
NetBSD-11-x86_64N/A2026/09/1811:53:3200:00:01ViewView
Rocky-10-x86_64N/A2026/09/1805:00:3800:00:00ViewView
Rocky-8-x86_64N/A2026/09/1801:23:5400:00:00ViewView
Ubuntu-20.04-x86_64N/A2026/09/2118:58:3800:00:01ViewView
Ubuntu-22.04-x86_64N/A2026/09/1808:43:5500:00:00ViewView
Ubuntu-24.04-x86_64N/A2026/09/1807:01:3100:00:00ViewView
Ubuntu-26.04-x86_64N/A2026/09/1805:18:0500:00:01ViewView

ros-py312-urdf-parser-0.4.0r1 (category wip or summary)

Platform Status Date Time Log files
Start Total brokenbuildbulkcbbhcmakeconfigureextractinstallplist
Debian-11-x86_64N/A2026/09/1802:50:0100:00:01ViewView
Debian-12-x86_64N/A2026/09/1807:23:4100:00:00ViewView
Debian-13-x86_64N/A2026/09/1805:14:4800:00:00ViewView
Fedora-42-x86_64N/A2026/09/1809:02:3800:00:00ViewView
Fedora-44-x86_64N/A2026/09/1808:07:2500:00:01ViewView
NetBSD-11-x86_64N/A2026/09/1811:53:3300:00:01ViewView
Rocky-10-x86_64Broken2026/09/2217:46:0800:00:08
make: *** [package] Error 2
ViewViewViewViewViewViewView
Rocky-8-x86_64N/A2026/09/1801:23:5500:00:00ViewView
Ubuntu-20.04-x86_64N/A2026/09/2118:58:3900:00:00ViewView
Ubuntu-22.04-x86_64N/A2026/09/1808:43:5500:00:01ViewView
Ubuntu-24.04-x86_64Broken2026/09/2218:10:5100:00:08
make: *** [package] Error 2
ViewViewViewViewViewViewView
Ubuntu-26.04-x86_64N/A2026/09/1805:18:0600:00:00ViewView

ros-py313-urdf-parser-0.4.0r1 (category wip or summary)

Platform Status Date Time Log files
Start Total brokenbuildbulkcbbhcmakeconfigureextractinstallplist
Debian-11-x86_64N/A2026/09/1802:50:0200:00:00ViewView
Debian-12-x86_64N/A2026/09/1807:23:4100:00:00ViewView
Debian-13-x86_64Broken2026/09/2218:36:4500:00:09
make: *** [package] Error 2
ViewViewViewViewViewViewView
Fedora-42-x86_64Broken2026/09/2217:57:5800:00:10
make: *** [package] Error 2
ViewViewViewViewViewViewView
Fedora-44-x86_64N/A2026/09/1808:07:2600:00:01ViewView
NetBSD-11-x86_64Broken2026/09/2217:47:3600:00:11
/usr/pkg/bin/gmake: *** [package] Error 2
ViewViewViewViewViewViewView
Rocky-10-x86_64N/A2026/09/1805:00:3900:00:00ViewView
Rocky-8-x86_64N/A2026/09/1801:23:5500:00:01ViewView
Ubuntu-20.04-x86_64N/A2026/09/2118:58:4000:00:00ViewView
Ubuntu-22.04-x86_64N/A2026/09/1808:43:5600:00:00ViewView
Ubuntu-24.04-x86_64N/A2026/09/1807:01:3100:00:00ViewView
Ubuntu-26.04-x86_64N/A2026/09/1805:18:0700:00:00ViewView

ros-py314-urdf-parser-0.4.0r1 (category wip or summary)

Platform Status Date Time Log files
Start Total brokenbuildbulkcbbhcmakeconfigureextractinstallplist
Debian-11-x86_64N/A2026/09/1802:50:0200:00:01ViewView
Debian-12-x86_64N/A2026/09/1807:23:4200:00:00ViewView
Debian-13-x86_64N/A2026/09/1805:14:4800:00:01ViewView
Fedora-42-x86_64N/A2026/09/1809:02:3900:00:00ViewView
Fedora-44-x86_64Broken2026/09/2217:51:5200:00:10
make: *** [package] Error 2
ViewViewViewViewViewViewView
NetBSD-11-x86_64N/A2026/09/1811:53:4700:00:00ViewView
Rocky-10-x86_64N/A2026/09/1805:00:3900:00:01ViewView
Rocky-8-x86_64N/A2026/09/1801:23:5600:00:00ViewView
Ubuntu-20.04-x86_64N/A2026/09/2118:58:4000:00:01ViewView
Ubuntu-22.04-x86_64N/A2026/09/1808:43:5700:00:00ViewView
Ubuntu-24.04-x86_64N/A2026/09/1807:01:3200:00:00ViewView
Ubuntu-26.04-x86_64Broken2026/09/2218:40:4600:00:11
make: *** [package] Error 2
ViewViewViewViewViewViewView

ros-py36-urdf-parser-0.4.0r1 (category wip or summary)

Platform Status Date Time Log files
Start Total brokenbuildbulkcbbhcmakeconfigureextractinstall
Debian-11-x86_64N/A2026/09/1802:50:0300:00:00ViewView
Debian-12-x86_64N/A2026/09/1807:23:4200:00:00ViewView
Debian-13-x86_64N/A2026/09/1805:14:4900:00:00ViewView
Fedora-42-x86_64N/A2026/09/1809:02:4000:00:00ViewView
Fedora-44-x86_64N/A2026/09/1808:07:2700:00:01ViewView
NetBSD-11-x86_64N/A2026/09/1811:53:4800:00:00ViewView
Rocky-10-x86_64N/A2026/09/1805:00:4000:00:00ViewView
Rocky-8-x86_64Broken2026/09/2217:40:2800:00:07
make: *** [package] Error 2
ViewViewViewViewViewView
Ubuntu-20.04-x86_64N/A2026/09/2118:58:4100:00:01ViewView
Ubuntu-22.04-x86_64N/A2026/09/1808:43:5700:00:01ViewView
Ubuntu-24.04-x86_64N/A2026/09/1807:01:3200:00:00ViewView
Ubuntu-26.04-x86_64N/A2026/09/1805:18:0700:00:01ViewView

ros-py38-urdf-parser-0.4.0r1 (category wip or summary)

Platform Status Date Time Log files
Start Total brokenbuildbulkcbbhcmakeconfigureextractinstall
Debian-11-x86_64N/A2026/09/1802:50:0300:00:00ViewView
Debian-12-x86_64N/A2026/09/1807:23:4300:00:00ViewView
Debian-13-x86_64N/A2026/09/1805:14:4900:00:01ViewView
Fedora-42-x86_64N/A2026/09/1809:02:4000:00:01ViewView
Fedora-44-x86_64N/A2026/09/1808:07:2800:00:01ViewView
NetBSD-11-x86_64N/A2026/09/1811:53:4900:00:00ViewView
Rocky-10-x86_64N/A2026/09/1805:00:4000:00:01ViewView
Rocky-8-x86_64N/A2026/09/1801:23:5700:00:00ViewView
Ubuntu-20.04-x86_64Broken2026/09/2218:17:3200:00:11
make: *** [package] Error 2
ViewViewViewViewViewView
Ubuntu-22.04-x86_64N/A2026/09/1808:43:5800:00:00ViewView
Ubuntu-24.04-x86_64N/A2026/09/1807:01:3300:00:00ViewView
Ubuntu-26.04-x86_64N/A2026/09/1805:18:0800:00:00ViewView

ros-py39-urdf-parser-0.4.0r1 (category wip or summary)

Platform Status Date Time Log files
Start Total brokenbuildbulkcbbhcmakeconfigureextractinstall
Debian-11-x86_64Broken2026/09/2217:39:4800:00:07
make: *** [package] Error 2
ViewViewViewViewViewView
Debian-12-x86_64N/A2026/09/1807:23:4300:00:01ViewView
Debian-13-x86_64N/A2026/09/1805:14:5000:00:00ViewView
Fedora-42-x86_64N/A2026/09/1809:02:4100:00:01ViewView
Fedora-44-x86_64N/A2026/09/1808:07:2900:00:00ViewView
NetBSD-11-x86_64N/A2026/09/1811:53:5000:00:00ViewView
Rocky-10-x86_64N/A2026/09/1805:00:4100:00:00ViewView
Rocky-8-x86_64N/A2026/09/1801:23:5700:00:01ViewView
Ubuntu-20.04-x86_64N/A2026/09/2118:58:4200:00:00ViewView
Ubuntu-22.04-x86_64N/A2026/09/1808:43:5900:00:00ViewView
Ubuntu-24.04-x86_64N/A2026/09/1807:01:3300:00:00ViewView
Ubuntu-26.04-x86_64N/A2026/09/1805:18:0800:00:01ViewView