robotpkg/wip/py-scs bulk build results

Log for py314-scs-2.1.2 on Ubuntu-26.04-x86_64: bulk.log (Back)

=> Checking for clear installation ===> Installing bootstrap dependencies for py314-scs-2.1.2 => Installing /opt/robotpkg/var/lib/robotpkg/packages/bsd/Ubuntu-26.04-x86_64/All/digest-20080510.tgz => Installing /opt/robotpkg/var/lib/robotpkg/packages/bsd/Ubuntu-26.04-x86_64/All/tnftp-20151004~ssl.tgz ===> Checking bootstrap dependencies for py314-scs-2.1.2 => Required robotpkg package digest>=20080510: digest-20080510 found => Required robotpkg package tnftp>=20130505~ssl: tnftp-20151004~ssl found => Required system package gnupg>=1: gnupg-2.4.8 found => Required system package gzip: gzip-1.14 found => Required system package pax and tar archivers: pax found => Required system package pkg_install>=20110805.12: pkg_install-20211115.4 found => Required system package pkgrepo2deb>=1.9: pkgrepo2deb-1.16 found ===> Done bootstrap-depends for py314-scs-2.1.2 ===> Installing full dependencies for py314-scs-2.1.2 => Dependency digest-20080510 already installed => Dependency tnftp-20151004~ssl already installed ===> Checking build options for py314-scs-2.1.2 => Building with no option. ===> Checking alternatives for py314-scs-2.1.2 => Use the GNU C++ compiler: c++-compiler provided by g++>=3 => Use the GNU C compiler: c-compiler provided by gcc>=3 => Use python-3.14: python>=2.5 provided by python314>=3.14<3.15 ===> Checking dependencies for py314-scs-2.1.2 => Required system package g++>=3: g++-15.2.0 found => Required system package gcc>=3: gcc-15.2.0 found => Required system package libstdc++: libstdc++ found => Required system package py314-numpy>=1: py314-numpy-2.3.5 found => Required system package py314-scipy>=0.17.0: py314-scipy-1.16.3 found => Required system package py314-setuptools: py314-setuptools found => Required system package python314>=3.14<3.15: python314-3.14.4 found ===> Done depends for py314-scs-2.1.2 ===> Extracting for py314-scs-2.1.2 => SHA1 checksums OK => RMD160 checksums OK ===> Configuring for py314-scs-2.1.2 ===> Building for py314-scs-2.1.2 Traceback (most recent call last): File "/local/robotpkg/var/tmp/robotpkg/wip/py-scs/work/scs-2.1.2/setup.py", line 2, in <module> from distutils.msvccompiler import MSVCCompiler ModuleNotFoundError: No module named 'distutils.msvccompiler' An unexpected error occured. The last 10 log lines are shown below. | MFLAGS=--no-print-directory | CC=/usr/bin/gcc | NODENAME=hydra64-ubuntu2604 | --- | Running set -e; cd /local/robotpkg/var/tmp/robotpkg/wip/py-scs/work/scs-2.1.2 && cd '/local/robotpkg/var/tmp/robotpkg/wip/py-scs/work/scs-2.1.2' && | /usr/bin/python3.14 setup.py build | Traceback (most recent call last): | File "/local/robotpkg/var/tmp/robotpkg/wip/py-scs/work/scs-2.1.2/setup.py", line 2, in <module> | from distutils.msvccompiler import MSVCCompiler | ModuleNotFoundError: No module named 'distutils.msvccompiler' For details or bug reports, check the complete log file in: /local/robotpkg/var/tmp/robotpkg/wip/py-scs/work/build.log make[3]: *** [../../mk/sysdep/py-setuptools.mk:48: do-build-setuptools(/local/robotpkg/var/tmp/robotpkg/wip/py-scs/work/scs-2.1.2)] Error 1 make[2]: *** [/local/robotpkg/var/lib/robotpkg/mk/pkg/package.mk:42: pkg-check-installed] Error 2 => Marking py314-scs-2.1.2 as broken ERROR: make: *** [package] Error 2 ===> Deinstalling for py314-scs Removed digest-20080510 Removed tnftp-20151004~ssl