robotpkg/wip/py-qt-gepetto-pythonqt bulk build results

py27-qt4-gepetto-pythonqt-0.0.1r2 (category wip or summary)

Platform Status Date Time Log files
Start Total brokenbulkcmakeconfigureextract
CentOS-7-x86_64OK2019/07/1721:16:4700:02:59
Debian-8-x86_64OK2019/07/1720:19:4600:06:08
Debian-9-x86_64OK2019/07/1800:10:1100:04:32
Fedora-27-x86_64OK2019/07/1803:33:4500:01:47
Fedora-28-x86_64OK2019/07/1800:56:5200:03:19
NetBSD-8.0-x86_64Broken2019/08/1219:38:5600:00:06
/usr/pkg/bin/gmake: *** [package] Error 2
ViewViewViewView
Ubuntu-14.04-x86_64OK2019/07/1723:08:1100:04:09
Ubuntu-16.04-x86_64OK2019/07/1723:38:2600:04:42
Ubuntu-18.04-x86_64OK2019/07/1720:16:0700:06:54
Ubuntu-19.04-x86_64OK2019/07/1801:56:0500:04:43

py27-qt5-gepetto-pythonqt-0.0.1r2 (category wip or summary)

Platform Status Date Time Log files
Start Total brokenbulkcmakeconfigureextract
CentOS-7-x86_64Broken2019/08/1219:53:0900:00:03
make: *** [package] Error 2
ViewViewViewView
Debian-8-x86_64Broken2019/08/1218:26:2600:00:08
make: *** [package] Error 2
ViewViewViewView
Debian-9-x86_64Broken2019/08/1218:12:5400:00:10
make: *** [package] Error 2
ViewViewViewView
Fedora-27-x86_64Broken2019/08/1219:19:0200:00:09
make: *** [package] Error 2
ViewViewViewView
Fedora-28-x86_64Broken2019/08/1219:25:1000:00:08
make: *** [package] Error 2
ViewViewViewView
NetBSD-8.0-x86_64OK2019/07/1722:30:5200:08:05
Ubuntu-14.04-x86_64Broken2019/08/1218:59:2200:00:03
make: *** [package] Error 2
ViewViewViewView
Ubuntu-16.04-x86_64OK2019/07/1723:43:0800:05:15
Ubuntu-18.04-x86_64Broken2019/08/1218:23:5200:00:05
make: *** [package] Error 2
ViewViewViewView
Ubuntu-19.04-x86_64Broken2019/08/1218:33:2500:00:12
make: *** [package] Error 2
ViewViewViewView

py34-qt4-gepetto-pythonqt-0.0.1r2 (category wip or summary)

Platform Status Date Time Log files
Start Total brokenbuildbulkcbbhcmakeconfigureextractinstallplist
CentOS-7-x86_64Broken2019/08/1219:53:1300:01:36
make: *** [package] Error 2
ViewViewViewViewViewViewView
Debian-8-x86_64Broken2019/08/1218:26:3500:03:10
make: *** [package] Error 2
ViewViewViewViewViewViewView
Debian-9-x86_64N/A2019/07/1800:14:4900:00:00ViewView
Fedora-27-x86_64N/A2019/07/1803:35:3800:00:00ViewView
Fedora-28-x86_64N/A2019/07/1801:00:2500:00:00ViewView
NetBSD-8.0-x86_64N/A2019/07/1722:38:5800:00:00ViewView
Ubuntu-14.04-x86_64Broken2019/08/1218:59:2600:02:40
make: *** [package] Error 2
ViewViewViewViewViewViewView
Ubuntu-16.04-x86_64N/A2019/07/1723:48:2400:00:00ViewView
Ubuntu-18.04-x86_64N/A2019/07/1720:23:1300:00:01ViewView
Ubuntu-19.04-x86_64N/A2019/07/1802:01:0200:00:00ViewView

py34-qt5-gepetto-pythonqt-0.0.1r2 (category wip or summary)

Platform Status Date Time Log files
Start Total brokenbulkcbbhcmakeconfigureextract
CentOS-7-x86_64Broken2019/08/1219:54:4900:00:04
make: *** [package] Error 2
ViewViewViewView
Debian-8-x86_64Broken2019/08/1218:29:4600:00:05
make: *** [package] Error 2
ViewViewViewView
Debian-9-x86_64N/A2019/07/1800:14:5000:00:00ViewView
Fedora-27-x86_64N/A2019/07/1803:35:3800:00:01ViewView
Fedora-28-x86_64N/A2019/07/1801:00:2600:00:00ViewView
NetBSD-8.0-x86_64N/A2019/07/1722:38:5900:00:01ViewView
Ubuntu-14.04-x86_64Broken2019/08/1219:02:0700:00:03
make: *** [package] Error 2
ViewViewViewView
Ubuntu-16.04-x86_64N/A2019/07/1723:48:2500:00:01ViewView
Ubuntu-18.04-x86_64N/A2019/07/1720:23:1400:00:01ViewView
Ubuntu-19.04-x86_64N/A2019/07/1802:01:0200:00:01ViewView

py35-qt4-gepetto-pythonqt-0.0.1r2 (category wip or summary)

Platform Status Date Time Log files
Start Total brokenbuildbulkcbbhcmakeconfigureextractinstallplist
CentOS-7-x86_64N/A2019/07/1721:23:5600:00:01ViewView
Debian-8-x86_64N/A2019/07/1720:30:3600:00:00ViewView
Debian-9-x86_64Broken2019/08/1218:13:0400:02:27
make: *** [package] Error 2
ViewViewViewViewViewViewView
Fedora-27-x86_64N/A2019/07/1803:35:3900:00:00ViewView
Fedora-28-x86_64N/A2019/07/1801:00:2600:00:01ViewView
NetBSD-8.0-x86_64N/A2019/07/1722:39:0000:00:01ViewView
Ubuntu-14.04-x86_64N/A2019/07/1723:15:3700:00:00ViewView
Ubuntu-16.04-x86_64Broken2019/08/1218:36:3400:04:04
make: *** [package] Error 2
ViewViewViewViewViewViewView
Ubuntu-18.04-x86_64N/A2019/07/1720:23:1500:00:00ViewView
Ubuntu-19.04-x86_64N/A2019/07/1802:01:0300:00:01ViewView

py35-qt5-gepetto-pythonqt-0.0.1r2 (category wip or summary)

Platform Status Date Time Log files
Start Total brokenbuildbulkcbbhcmakeconfigureextractinstallplist
CentOS-7-x86_64N/A2019/07/1721:23:5800:00:01ViewView
Debian-8-x86_64N/A2019/07/1720:30:3700:00:00ViewView
Debian-9-x86_64Broken2019/08/1218:15:3100:00:05
make: *** [package] Error 2
ViewViewViewView
Fedora-27-x86_64N/A2019/07/1803:35:3900:00:01ViewView
Fedora-28-x86_64N/A2019/07/1801:00:2700:00:01ViewView
NetBSD-8.0-x86_64N/A2019/07/1722:39:0100:00:01ViewView
Ubuntu-14.04-x86_64N/A2019/07/1723:15:3800:00:00ViewView
Ubuntu-16.04-x86_64Broken2019/08/1218:40:3900:05:21
make: *** [package] Error 2
ViewViewViewViewViewViewView
Ubuntu-18.04-x86_64N/A2019/07/1720:23:1600:00:00ViewView
Ubuntu-19.04-x86_64N/A2019/07/1802:01:0400:00:01ViewView

py36-qt4-gepetto-pythonqt-0.0.1r2 (category wip or summary)

Platform Status Date Time Log files
Start Total brokenbuildbulkcbbhcmakeconfigureextractinstallplist
CentOS-7-x86_64N/A2019/07/1721:23:5900:00:01ViewView
Debian-8-x86_64N/A2019/07/1720:30:3800:00:01ViewView
Debian-9-x86_64N/A2019/07/1800:18:3100:00:01ViewView
Fedora-27-x86_64Broken2019/08/1219:19:1200:03:08
make: *** [package] Error 2
ViewViewViewViewViewViewView
Fedora-28-x86_64Broken2019/08/1219:25:1900:02:55
make: *** [package] Error 2
ViewViewViewViewViewViewView
NetBSD-8.0-x86_64Broken2019/08/1219:39:0300:00:06
/usr/pkg/bin/gmake: *** [package] Error 2
ViewViewViewView
Ubuntu-14.04-x86_64N/A2019/07/1723:15:3800:00:01ViewView
Ubuntu-16.04-x86_64N/A2019/07/1723:55:5600:00:01ViewView
Ubuntu-18.04-x86_64Broken2019/08/1218:23:5800:03:51
make: *** [package] Error 2
ViewViewViewViewViewViewView
Ubuntu-19.04-x86_64N/A2019/07/1802:01:0500:00:00ViewView

py36-qt5-gepetto-pythonqt-0.0.1r2 (category wip or summary)

Platform Status Date Time Log files
Start Total brokenbuildbulkcbbhcmakeconfigureextractinstallplist
CentOS-7-x86_64N/A2019/07/1721:24:0100:00:00ViewView
Debian-8-x86_64N/A2019/07/1720:30:3900:00:01ViewView
Debian-9-x86_64N/A2019/07/1800:18:3200:00:00ViewView
Fedora-27-x86_64Broken2019/08/1219:22:2000:00:15
make: *** [package] Error 2
ViewViewViewView
Fedora-28-x86_64Broken2019/08/1219:28:1500:00:07
make: *** [package] Error 2
ViewViewViewView
NetBSD-8.0-x86_64Broken2019/08/1219:39:0900:03:12
/usr/pkg/bin/gmake: *** [package] Error 2
ViewViewViewViewViewViewView
Ubuntu-14.04-x86_64N/A2019/07/1723:15:3900:00:01ViewView
Ubuntu-16.04-x86_64N/A2019/07/1723:55:5700:00:00ViewView
Ubuntu-18.04-x86_64Broken2019/08/1218:27:5000:00:07
make: *** [package] Error 2
ViewViewViewView
Ubuntu-19.04-x86_64N/A2019/07/1802:01:0600:00:00ViewView

py37-qt4-gepetto-pythonqt-0.0.1r2 (category wip or summary)

Platform Status Date Time Log files
Start Total brokenbuildbulkcbbhcmakeconfigureextractinstallplist
CentOS-7-x86_64N/A2019/07/1721:24:0200:00:01ViewView
Debian-8-x86_64N/A2019/07/1720:30:4100:00:01ViewView
Debian-9-x86_64N/A2019/07/1800:18:3300:00:00ViewView
Fedora-27-x86_64N/A2019/07/1803:37:3400:00:00ViewView
Fedora-28-x86_64N/A2019/07/1801:04:0800:00:01ViewView
NetBSD-8.0-x86_64N/A2019/07/1722:44:4300:00:00ViewView
Ubuntu-14.04-x86_64N/A2019/07/1723:15:4000:00:01ViewView
Ubuntu-16.04-x86_64N/A2019/07/1723:55:5700:00:01ViewView
Ubuntu-18.04-x86_64N/A2019/07/1720:29:3500:00:00ViewView
Ubuntu-19.04-x86_64Broken2019/08/1218:33:3900:04:17
make: *** [package] Error 2
ViewViewViewViewViewViewView

py37-qt5-gepetto-pythonqt-0.0.1r2 (category wip or summary)

Platform Status Date Time Log files
Start Total brokenbulkcbbhcmakeconfigureextract
CentOS-7-x86_64N/A2019/07/1721:24:0400:00:01ViewView
Debian-8-x86_64N/A2019/07/1720:30:4200:00:01ViewView
Debian-9-x86_64N/A2019/07/1800:18:3300:00:01ViewView
Fedora-27-x86_64N/A2019/07/1803:37:3400:00:00ViewView
Fedora-28-x86_64N/A2019/07/1801:04:0900:00:01ViewView
NetBSD-8.0-x86_64N/A2019/07/1722:44:4300:00:01ViewView
Ubuntu-14.04-x86_64N/A2019/07/1723:15:4200:00:00ViewView
Ubuntu-16.04-x86_64N/A2019/07/1723:55:5800:00:01ViewView
Ubuntu-18.04-x86_64N/A2019/07/1720:29:3600:00:00ViewView
Ubuntu-19.04-x86_64Broken2019/08/1218:37:5700:00:15
make: *** [package] Error 2
ViewViewViewView