robotpkg/wip/py-pycppad bulk build results

pycppad-1.2.2 (category math or summary)

Platform Status Date Time Log files
Start Total brokenbrokenbybulkcbbhcbbhbyfetch
Debian-11-x86_64N/A2026/09/1421:32:2400:00:04ViewView
cmake>=3.22
Debian-12-x86_64Broken2026/09/1422:24:4000:00:06
make: *** [package] Error 2
ViewView
Debian-13-x86_64Broken2026/09/1208:03:5800:00:05
make: *** [package] Error 2
ViewView
Fedora-42-x86_64Broken2026/09/1208:33:4100:00:07
make: *** [package] Error 2
ViewView
Fedora-44-x86_64Broken2026/09/1421:55:1000:00:04
Required robotpkg package cppad>=20200000.2: BROKEN Required robotpkg package cppadcodegen>=2.3.0: BROKEN
View
NetBSD-10.0-x86_64Broken2026/09/1011:49:3100:00:10
/usr/pkg/bin/gmake: *** [package] Error 2
ViewView
NetBSD-11-x86_64Broken2026/09/1421:20:2300:00:05
Required robotpkg package cppad>=20200000.2: BROKEN Required robotpkg package cppadcodegen>=2.3.0: BROKEN
View
Rocky-10-x86_64Broken2026/09/1421:57:4200:00:09
make: *** [package] Error 2
ViewView
Rocky-8-x86_64Broken2026/09/1421:27:0300:00:10
make: *** [package] Error 2
ViewView
Ubuntu-20.04-x86_64N/A2026/09/1208:37:5300:00:05ViewView
cmake>=3.22
Ubuntu-22.04-x86_64Broken2026/09/1422:21:0900:00:08
make: *** [package] Error 2
ViewView
Ubuntu-24.04-x86_64Broken2026/09/1422:37:0800:00:06
make: *** [package] Error 2
ViewView
Ubuntu-26.04-x86_64Broken2026/09/1422:33:0200:00:03
Required robotpkg package cppad>=20200000.2: BROKEN Required robotpkg package cppadcodegen>=2.3.0: BROKEN
View