robotpkg/wip/py-parametric-curves bulk build results

py27-parametric-curves-1.2.1 (category wip or summary)

Platform Status Date Time Log files
Start Total brokenbuildbulkcmakeconfigureextract
CentOS-7-x86_64Broken2019/08/1219:42:2800:00:26
make: *** [package] Error 2
ViewViewViewViewView
Debian-8-x86_64Broken2019/08/1218:59:4400:00:35
make: *** [package] Error 2
ViewViewViewViewView
Debian-9-x86_64OK2019/07/1801:44:2500:01:12
Fedora-27-x86_64OK2019/07/1803:26:1100:00:43
Fedora-28-x86_64OK2019/07/1800:42:1000:01:25
NetBSD-8.0-x86_64OK2019/07/1723:10:1600:01:31
Ubuntu-14.04-x86_64Broken2019/08/1219:25:4700:00:35
make: *** [package] Error 2
ViewViewViewViewView
Ubuntu-16.04-x86_64OK2019/07/1801:58:0300:01:31
Ubuntu-18.04-x86_64OK2019/07/1722:18:5600:01:31
Ubuntu-19.04-x86_64Broken2019/08/1219:05:1900:00:28
make: *** [package] Error 2
ViewViewViewView

py34-parametric-curves-1.2.1 (category wip or summary)

Platform Status Date Time Log files
Start Total brokenbuildbulkcbbhcbbhbycmakeconfigureextractsysdep
CentOS-7-x86_64Sysdep2019/08/1219:42:5400:00:08ViewView
boost-libs>=1.34.1
View
Debian-8-x86_64Broken2019/08/1219:00:1900:00:33
make: *** [package] Error 2
ViewViewViewViewView
Debian-9-x86_64N/A2019/07/1801:45:3700:00:01ViewView
Fedora-27-x86_64N/A2019/07/1803:26:5400:00:00ViewView
Fedora-28-x86_64N/A2019/07/1800:43:3500:00:01ViewView
NetBSD-8.0-x86_64N/A2019/07/1723:11:4800:00:00ViewView
Ubuntu-14.04-x86_64Broken2019/08/1219:26:2200:00:29
make: *** [package] Error 2
ViewViewViewViewView
Ubuntu-16.04-x86_64N/A2019/07/1801:59:3500:00:01ViewView
Ubuntu-18.04-x86_64N/A2019/07/1722:20:2800:00:00ViewView
Ubuntu-19.04-x86_64N/A2019/07/1803:09:3300:00:00ViewView

py35-parametric-curves-1.2.1 (category wip or summary)

Platform Status Date Time Log files
Start Total bulkcbbh
CentOS-7-x86_64N/A2019/07/1721:03:1700:00:01ViewView
Debian-8-x86_64N/A2019/07/1721:59:0000:00:00ViewView
Debian-9-x86_64OK2019/07/1801:45:3800:01:18
Fedora-27-x86_64N/A2019/07/1803:26:5400:00:01ViewView
Fedora-28-x86_64N/A2019/07/1800:43:3600:00:01ViewView
NetBSD-8.0-x86_64N/A2019/07/1723:11:4800:00:01ViewView
Ubuntu-14.04-x86_64N/A2019/07/1801:31:3500:00:01ViewView
Ubuntu-16.04-x86_64OK2019/07/1801:59:3600:01:27
Ubuntu-18.04-x86_64N/A2019/07/1722:20:2800:00:01ViewView
Ubuntu-19.04-x86_64N/A2019/07/1803:09:3300:00:00ViewView

py36-parametric-curves-1.2.1 (category wip or summary)

Platform Status Date Time Log files
Start Total bulkcbbh
CentOS-7-x86_64N/A2019/07/1721:03:1900:00:01ViewView
Debian-8-x86_64N/A2019/07/1721:59:0100:00:01ViewView
Debian-9-x86_64N/A2019/07/1801:46:5600:00:00ViewView
Fedora-27-x86_64OK2019/07/1803:26:5500:00:40
Fedora-28-x86_64OK2019/07/1800:43:3700:01:05
NetBSD-8.0-x86_64OK2019/07/1723:11:4900:01:12
Ubuntu-14.04-x86_64N/A2019/07/1801:31:3600:00:00ViewView
Ubuntu-16.04-x86_64N/A2019/07/1802:01:0400:00:00ViewView
Ubuntu-18.04-x86_64OK2019/07/1722:20:2900:01:11
Ubuntu-19.04-x86_64N/A2019/07/1803:09:3300:00:01ViewView

py37-parametric-curves-1.2.1 (category wip or summary)

Platform Status Date Time Log files
Start Total brokenbulkcbbhcmakeconfigureextract
CentOS-7-x86_64N/A2019/07/1721:03:2000:00:01ViewView
Debian-8-x86_64N/A2019/07/1721:59:0300:00:00ViewView
Debian-9-x86_64N/A2019/07/1801:46:5700:00:00ViewView
Fedora-27-x86_64N/A2019/07/1803:27:3500:00:00ViewView
Fedora-28-x86_64N/A2019/07/1800:44:4200:00:01ViewView
NetBSD-8.0-x86_64N/A2019/07/1723:13:0200:00:00ViewView
Ubuntu-14.04-x86_64N/A2019/07/1801:31:3600:00:00ViewView
Ubuntu-16.04-x86_64N/A2019/07/1802:01:0500:00:00ViewView
Ubuntu-18.04-x86_64N/A2019/07/1722:21:4000:00:00ViewView
Ubuntu-19.04-x86_64Broken2019/08/1219:05:4700:00:24
make: *** [package] Error 2
ViewViewViewView