robotpkg/wip/py-jsbsim bulk build results

py27-jsbsim-20150424r1 (category simulation or summary)

Platform Status Date Time Log files
Start Total brokenbulkcmakeconfigureextract
CentOS-7-x86_64Broken2018/11/2013:52:0700:00:06
make: *** [package] Error 2
ViewViewViewView
Debian-8-x86_64Broken2018/11/2013:26:3900:00:04
make: *** [package] Error 2
ViewViewViewView
Fedora-27-x86_64Broken2018/11/2013:59:2300:00:06
make: *** [package] Error 2
ViewViewViewView
Fedora-28-x86_64Broken2018/11/2013:46:5800:00:07
make: *** [package] Error 2
ViewViewViewView
NetBSD-8.0-x86_64Broken2018/11/2013:41:2700:00:07
/usr/pkg/bin/gmake: *** [package] Error 2
ViewViewViewView
Ubuntu-12.04-i386Broken2018/11/2013:20:0900:00:04
make: *** [package] Error 2
ViewViewViewView
Ubuntu-12.04-x86_64Broken2018/11/2013:07:3600:00:03
make: *** [package] Error 2
ViewViewViewView
Ubuntu-14.04-x86_64Broken2018/11/2013:11:4600:00:05
make: *** [package] Error 2
ViewViewViewView
Ubuntu-16.04-x86_64Broken2018/11/2012:56:3000:00:04
make: *** [package] Error 2
ViewViewViewView
Ubuntu-18.04-x86_64Broken2018/11/2013:06:4200:00:05
make: *** [package] Error 2
ViewViewViewView

py32-jsbsim-20150424r1 (category simulation or summary)

Platform Status Date Time Log files
Start Total brokenbulkcbbhcmakeconfigureextract
CentOS-7-x86_64N/A2018/11/1515:39:5100:00:01ViewView
Debian-8-x86_64N/A2018/11/1514:49:2300:00:00ViewView
Fedora-27-x86_64N/A2018/11/1518:36:1100:00:00ViewView
Fedora-28-x86_64N/A2018/11/1517:35:4200:00:00ViewView
NetBSD-8.0-x86_64N/A2018/11/1512:44:3200:00:00ViewView
Ubuntu-12.04-i386Broken2018/11/2013:20:1400:00:03
make: *** [package] Error 2
ViewViewViewView
Ubuntu-12.04-x86_64Broken2018/11/2013:07:3900:00:03
make: *** [package] Error 2
ViewViewViewView
Ubuntu-14.04-x86_64N/A2018/11/1512:54:5200:00:00ViewView
Ubuntu-16.04-x86_64N/A2018/11/1515:10:3200:00:00ViewView
Ubuntu-18.04-x86_64N/A2018/11/1512:30:4700:00:01ViewView

py34-jsbsim-20150424r1 (category simulation or summary)

Platform Status Date Time Log files
Start Total brokenbulkcbbhcmakeconfigureextract
CentOS-7-x86_64Broken2018/11/2013:52:1400:00:07
make: *** [package] Error 2
ViewViewViewView
Debian-8-x86_64Broken2018/11/2013:26:4300:00:04
make: *** [package] Error 2
ViewViewViewView
Fedora-27-x86_64N/A2018/11/1518:36:1100:00:01ViewView
Fedora-28-x86_64N/A2018/11/1517:35:4200:00:00ViewView
NetBSD-8.0-x86_64N/A2018/11/1512:44:3300:00:00ViewView
Ubuntu-12.04-i386N/A2018/11/1514:44:5000:00:01ViewView
Ubuntu-12.04-x86_64N/A2018/11/1512:14:0900:00:00ViewView
Ubuntu-14.04-x86_64Broken2018/11/2013:11:5100:00:04
make: *** [package] Error 2
ViewViewViewView
Ubuntu-16.04-x86_64N/A2018/11/1515:10:3300:00:00ViewView
Ubuntu-18.04-x86_64N/A2018/11/1512:30:4800:00:00ViewView

py35-jsbsim-20150424r1 (category simulation or summary)

Platform Status Date Time Log files
Start Total brokenbulkcbbhcmakeconfigureextract
CentOS-7-x86_64N/A2018/11/1515:39:5900:00:00ViewView
Debian-8-x86_64N/A2018/11/1514:49:2800:00:00ViewView
Fedora-27-x86_64N/A2018/11/1518:36:1200:00:00ViewView
Fedora-28-x86_64N/A2018/11/1517:35:4300:00:00ViewView
NetBSD-8.0-x86_64N/A2018/11/1512:44:3400:00:00ViewView
Ubuntu-12.04-i386N/A2018/11/1514:44:5100:00:00ViewView
Ubuntu-12.04-x86_64N/A2018/11/1512:14:0900:00:01ViewView
Ubuntu-14.04-x86_64N/A2018/11/1512:55:0100:00:00ViewView
Ubuntu-16.04-x86_64Broken2018/11/2012:56:3500:00:04
make: *** [package] Error 2
ViewViewViewView
Ubuntu-18.04-x86_64N/A2018/11/1512:30:4900:00:00ViewView

py36-jsbsim-20150424r1 (category simulation or summary)

Platform Status Date Time Log files
Start Total brokenbulkcbbhcmakeconfigureextract
CentOS-7-x86_64N/A2018/11/1515:39:5900:00:01ViewView
Debian-8-x86_64N/A2018/11/1514:49:2800:00:00ViewView
Fedora-27-x86_64Broken2018/11/2013:59:3000:00:07
make: *** [package] Error 2
ViewViewViewView
Fedora-28-x86_64Broken2018/11/2013:47:0500:00:07
make: *** [package] Error 2
ViewViewViewView
NetBSD-8.0-x86_64Broken2018/11/2013:41:3400:00:09
/usr/pkg/bin/gmake: *** [package] Error 2
ViewViewViewView
Ubuntu-12.04-i386N/A2018/11/1514:44:5100:00:01ViewView
Ubuntu-12.04-x86_64N/A2018/11/1512:14:1000:00:00ViewView
Ubuntu-14.04-x86_64N/A2018/11/1512:55:0100:00:01ViewView
Ubuntu-16.04-x86_64N/A2018/11/1515:10:4700:00:00ViewView
Ubuntu-18.04-x86_64Broken2018/11/2013:06:4800:00:05
make: *** [package] Error 2
ViewViewViewView

py37-jsbsim-20150424r1 (category simulation or summary)

Platform Status Date Time Log files
Start Total bulkcbbh
CentOS-7-x86_64N/A2018/11/1515:40:0000:00:00ViewView
Debian-8-x86_64N/A2018/11/1514:49:2800:00:00ViewView
Fedora-27-x86_64N/A2018/11/1518:36:1800:00:00ViewView
Fedora-28-x86_64N/A2018/11/1517:35:4900:00:00ViewView
NetBSD-8.0-x86_64N/A2018/11/1512:44:5400:00:01ViewView
Ubuntu-12.04-i386N/A2018/11/1514:44:5200:00:00ViewView
Ubuntu-12.04-x86_64N/A2018/11/1512:14:1100:00:00ViewView
Ubuntu-14.04-x86_64N/A2018/11/1512:55:0200:00:00ViewView
Ubuntu-16.04-x86_64N/A2018/11/1515:10:4700:00:01ViewView
Ubuntu-18.04-x86_64N/A2018/11/1512:30:5900:00:01ViewView